{"text_format":"1","workbook":"xlsx","n_sheets":50,"sheets":["Introduction","Mode d'emploi","Avertissements","Menu","ETAB","Etablissement","Score","Score1","CHAPI","EHPAD","Chapitre I","Score2","CHAPII","Eval 1","Outils 1","Chapitre II","Score3","CHAPIII","Eval 2","Outils 2","Chapitre III","Score4","CHAP IV","Eval 3","Outils 3","Chapitre IV","Score5","CHAPV","Eval 4","Outils 4","Chapitre V","Score6","CHAPVI","Eval 5","Outils 5","Chapitre VI","Score7","CHAPVII","Eval 6","Plan de maitrise épidémie ","GEA épid.","IRA épid.","Chapitre VII","Eval 7","PLAN d'ACTION","Protocoles","PAQ type GREPHH","Poster","Rapport","DARI"],"not_rendered":{"charts":21,"images":51,"macros":1,"external_links":7,"defined_names":281,"comments":0,"pivot_tables":0},"unopened":[],"bounds":{"document_bytes":16777216,"sheet_cells":100000,"rows_first":2000,"rows_last":500,"rows_between":2000,"halvings":0,"cell_chars":16384,"cell_head_chars":4096},"cells_cut":0,"cells_raw":0,"read":"whole","date_system":"1900"}

{"sheet":"Introduction","index":0,"n_rows":24,"n_cols":1,"rows_kept":24,"cut":false,"hidden":false,"merged":[]}
["AVANT PROPOS"]
["Fondement réglementaire"]
["Instruction N°DGOS/PF2/DGS/RI1/DGCS/2015/ 202 du 15 juin 2015 relative au Programme national d’actions de prévention des infections associées aux soins (PROPIAS) 2015"]
["Instruction N° DGCS/SPA/2016/195 du 15 juin 2016 relative à la mise en œuvre du Programme national d'actions de prévention des infections associées aux soins (PROPIAS) dans le secteur médico-social 2016/2018 :"]
["\"Le PROPIAS dans le secteur médico-social vise à renforcer la prévention du risque infectieux dans le secteur médico-social par la mise en place d'une démarche d'analyse des risques, pour une meilleure sécurité des résidents/usagers, pour limiter la diffusion des bactéries multi et hautement résistantes émergentes et pour participer à la lutte contre l'antibiorésistance. Les établissements concernés : EHPAD-MAS-FAM-IEM et établissements prenant en charge des enfants ou adolescents polyhandicapés, pourront utilement s'appuyer sur les outils développés à cette fin\""]
["L’option retenue est de promouvoir une démarche d’analyse de risque qui permette à chaque établissement d’évaluer le risque infectieux au regard de la situation épidémiologique et d’apprécier son niveau de maîtrise afin d’élaborer ou adapter son programme d’action. "]
["Le « document d’analyse de risque du risque infectieux » (DARI) formalise cette démarche. Ce document a vocation à être utilisé dans le cadre de l’évaluation interne, selon la fréquence prévue au deuxième alinéa de l’article D. 312-203 et à l’article D. 312-204 du code de l’action sociale et des familles, relative à la communication des résultats de l’évaluation interne. "]
[]
[" Le DARI est le document qui est composé de l'autoévaluation du GREPHH, de l'évaluation du risque infectieux, du suivi des indicateurs et du programme d'actions hiérarchisé."]
[]
[]
[]
["Mme Marie Azpurua, Infirmière hygiéniste ADEF Résidences (94)"]
["Mme Sandrine Biangoma, Praticien hygiéniste EOH Centre Hospitalier du Sud Seine et Marne (77)"]
["Mme Guylène Ganne, Cadre hygiéniste Hôpital Gériatrique les Magnolias (91)"]
["Mr Alexandre Gautier, Chirurgien Dentiste membre du réseau Appolline (91)"]
["Mme Claudie Le Gall, Infirmière Hygiéniste mobile Centre Hospitalier du Sud Seine et Marne (77)"]
["Mme Jennifer Lenoir, Infirmière mobile d'hygiène Clinique médicale du Parc (95)"]
["Mme Valérie Mathé, Médecin hygiéniste responsable de l'équipe mobile d'hygiène Hôpital Gériatrique les Magnolias (91)"]
["Mme Ivana Novakova, Infirmière hygiéniste ARLIN Ile de France (75)"]
["Mme Destinée Nsotha, Infirmère de l'équipe mobile d'hygiène Hôpital Gériatrique les Magnolias (91)"]
["Mme Christine Gilbert, médecin coordonnateur \"Résidence Harmonie\" (77)"]
["Mme Amandine Guyot, Infirmière coodinatrice EHPAD \"Les Brully\"s (77)"]
["Mme Christiane Dazy, Infirmière coordinatrice EHPAD \"Arthur Vernes\" (77)"]

{"sheet":"Mode d'emploi","index":1,"n_rows":49,"n_cols":12,"rows_kept":49,"cut":false,"hidden":false,"merged":[[3,1,6,6],[2,1,2,6],[15,11,19,17],[23,11,26,16]]}
[]
[]
[null,"Mode d'emploi: "]
[null,"Renseigner les informations au fur et à mesure dans les onglets suivant:\n - 'Etablissement' - 'EHPAD' - 'Chapitre I' - 'Eval 1' - … - 'Chapitre VI - 'Eval 6' - 'Plan de maitrise d'épidémie' (stock tampon...) - 'Chapitre VII' - 'Eval 7', sans oublier de cocher les cases correspondantes aux plans d'actions spécifiques des risques repérés dans votre structure dans les onglets 'Eval'\nRenseigner obligatoirement les cases indiquées 'à renseigner obligatoirement' en bleu \n\nHiérarchier le plan d'action automatiquement acrémenté dans l'onglet 'Plan d'action' après avoir cliqué sur \"ACTUALISER\". Programmer les échéances, en cochant les cases H, M, ou F, et nommer un responsable des actions avec une plannification.\n\nAjuster si besoin la taille des fenêtres du 'DARI' correspondant aux risques automatiquement acrémentés par le renseignement des onglets au fur et à mesure, et aux plans d'action par chapitre, qui ne seront acrémentés que s'il est hiérarchisé. Il est possible d'ajouter d'autres indicateurs de suivi ou des commentaires dans les cellules en bleu pâle.\n\nUn onglet 'Protocole' permet le suivi de la base documentaire\nLes onglets 'Outils' vous donnent des liens utiles ou des informations à titre indicatif.\n\nFaire attention  à enregistrer le fichier avec un nouveau nom avant chaque réévaluation"]
[]
[]
[]
[]
[]
[]
[]
[]
[]
[]
[null,null,null,null,null,null,null,null,null,null,null,"Autoévaluation du GREPHH "]
[null,null,null,null,null,null,null,null,null,null,null,"-Le poster peut être affiché à l'accueil pour information aux résident et aux familles\n'-Le score de l'autoévaluation constitue l'indicateur de suivi retenu par l'ANESM dans le cadre de l'évaluation interne\n'-Les résultats peuvent être présentés en réunion pluridisciplinaire"]
[]
[]
[]
[]
[]
[]
[]
[null,null,null,null,null,null,null,null,null,null,null,"Evaluation du risque infectieux de l' EHPAD avec plan d'action spécifique en lien et indicateurs de suivi……."]
[]
[]
[]
[]
[]
[]
[]
[]
[null,null,null,null,null,null,null,null,null,null,null,"PLAN D'AMELIORATION PLURI ANNUEL"]
[]
[]
[]
[]
[]
[]
[]
[null,null,null,null,null,null,null,null,null,null,null,"DARI"]
[]
[]
[]
[]
[]
[]
[]
[null,null,null,null,null,null,null,null,null,null,null,"Outils d'aide"]

{"sheet":"Avertissements","index":2,"n_rows":23,"n_cols":7,"rows_kept":23,"cut":false,"hidden":false,"merged":[[26,1,26,10],[12,0,12,10],[14,0,14,11],[15,0,15,11],[17,0,17,11],[22,0,23,11],[1,0,1,11],[2,0,2,11],[7,0,7,11],[13,0,13,10],[9,0,9,11],[10,0,10,11],[3,1,3,10],[6,0,6,11]]}
[]
["MAÎTRISE DU RISQUE INFECTIEUX EN EHPAD"]
["Manuel d'auto-évaluation"]
[null,"A LIRE AVANT DE COMMENCER LA SAISIE DES DONNEES"]
[]
[]
["Cet outil vous permet de saisir les fiches du manuel d'auto-évaluation de la maîtrise du risque infectieux "]
["en EHPAD."]
[]
["Il vous permet d'établir un rapport global et un poster contenant les scores que vous avez obtenus "]
["lors des différents chapitres étudiés."]
[]
["ATTENTION: Les données ne peuvent être saisies que dans des cellules vert pâle"]
["La saisie est obligatoire pour tous les critères qui vous sont proposés"]
["Pour certains items, lorsqu'une réponse négative est donnée, les questions suivantes apparaissent en gris: "]
["vous n'avez pas à y répondre."]
[]
["Pour commencer, cliquer sur l'onglet \"Menu\" situé en bas de l'écran ou sur le lien suivant:"]
[null,null,null,null,null,null,"MENU"]
[]
[]
[]
["En cas de problèmes, contactez votre CCLIN.\n(voir références dans le guide d'utilisation de l'outil informatique)"]

{"sheet":"Menu","index":3,"n_rows":24,"n_cols":3,"rows_kept":24,"cut":false,"hidden":false,"merged":[[2,2,2,5]]}
[]
[null,null,"MAÎTRISE DU RISQUE INFECTIEUX EN EHPAD"]
[null,null,"Manuel d'auto-évaluation"]
[]
[]
[null,null,"Menu principal"]
[null,null,"Cliquer sur les liens (texte souligné en bleu) "]
[]
[]
[null,null,"Fiche Etablissement"]
[]
[null,null,"Chapitre I - Organisation des moyens de prévention dans l'établissement"]
[]
[null,null,"Chapitre II - Gestion de l'environnement et des circuits"]
[]
[null,null,"Chapitre III - Gestion du matériel de soins"]
[]
[null,null,"Chapitre IV - Gestion des soins"]
[]
[null,null,"Chapitre V - Les vaccinations contre les affections respiratoires"]
[]
[null,null,"Chapitre VI - Gestion des risques épidémiques"]
[]
[null,null,"Chapitre VII - Prévention des accidents avec exposition au sang"]

{"sheet":"ETAB","index":4,"n_rows":2,"n_cols":12,"rows_kept":2,"cut":false,"hidden":true,"merged":[]}
["CODETAB","FINESS","CCLIN","NOMETAB","CP","VILLE","ARLIN","STATUT","NATURE","LITS","DATE","PERSONNE"]
[{"$f":"CODE","v":0},{"$f":"Etablissement!E7","v":0},{"$f":"Etablissement!E18","v":0},{"$f":"NOM","v":0},{"$f":"Etablissement!E11","v":0},{"$f":"Etablissement!E13","v":0},{"$f":"Etablissement!E15","v":0},{"$f":"STATUT","v":0},{"$f":"NATURE","v":0},{"$f":"NBLIT","v":0},{"$f":"DATE","v":"00:00:00"},{"$f":"Etablissement!E28","v":0}]

{"sheet":"Etablissement","index":5,"n_rows":74,"n_cols":7,"rows_kept":74,"cut":false,"hidden":false,"merged":[[27,4,30,8],[0,0,0,8],[36,0,36,7],[34,0,34,7],[4,4,4,8],[12,4,12,8],[14,4,14,8]]}
["FICHE ETABLISSEMENT"]
[]
[]
[]
[null,"Nom Etablissement"]
[]
[null,"Code Finess Etablissement*"]
[]
[null,"Code attribué par votre CCLIN*"]
[]
[null,"Code Postal"]
[]
[null,"Ville"]
[]
[null,"ARLIN"]
[null,"Antenne Régionale de Lutte contre les Infections Nosocomiales"]
[]
[null,"Code CCLIN",null,null,null,null,"1=Est, 2=Ouest, 3=Paris-Nord, 4=Sud-Est, 5=Sud-Ouest"]
[]
[null,"Statut ",null,null,null,null,"1=Public, 2=Privé"]
[]
[null,"Nature ",null,null,null,null,"1=Votre établissement est un EHPAD"]
[null,null,null,null,null,null,"2=Votre établissement de santé assure une activité EHPAD"]
[null,"Nombre total de lits EHPAD"]
[]
[null,"Date de l'évaluation",null,null,null,null,"format: jj/mm/aaaa"]
[]
[null,"Personne(s) ayant réalisé "]
[null,"l'évaluation"]
[]
[]
[]
[null,"*A remplir lors d'enquêtes organisées par le CCLIN / l'ARLIN (champs facultatifs)"]
[]
["MENU"]
[]
["CHAPITRE I"]
[]
[]
[]
[]
[]
[]
[]
[]
[]
[]
[]
["ALSACE"]
["AQUITAINE"]
["AUVERGNE"]
["BASSE NORMANDIE"]
["BOURGOGNE"]
["BRETAGNE"]
["CENTRE"]
["CHAMPAGNE ARDENNE"]
["CORSE"]
["FRANCHE COMTE"]
["GUADELOUPE"]
["GUYANE"]
["HAUTE NORMANDIE"]
["ILE DE FRANCE"]
["LANGUEDOC ROUSSILLON"]
["LIMOUSIN"]
["LORRAINE"]
["MARTINIQUE"]
["MIDI PYRENEES"]
["NORD PAS DE CALAIS"]
["PAYS DE LA LOIRE"]
["PICARDIE"]
["POITOU CHARENTES"]
["PROVENCE ALPES COTE D'AZUR"]
["REUNION"]
["RHONE ALPES"]

{"sheet":"Score","index":6,"n_rows":2,"n_cols":10,"rows_kept":2,"cut":false,"hidden":true,"merged":[]}
["CODETAB","FINESS","SCORE1","SCORE2","SCORE3","SCORE4","SCORE5","SCORE6","SCORE7","SCORE"]
[{"$f":"CODE","v":0},{"$f":"FINESS","v":0},{"$f":"Score1!AO2","v":0},{"$f":"Score2!DO2","v":3.8461538461538463},{"$f":"Score3!AE2","v":0},{"$f":"Score4!BE2","v":0},{"$f":"Score5!N2","v":0},{"$f":"Score6!AS2","v":0},{"$f":"Score7!AB2","v":0},{"$f":"(Score1!AM2+Score2!DM2+Score3!AC2+Score4!BC2+Score5!L2+Score6!AQ2+Score7!Z2)/(Score1!AN2+Score2!DN2+Score3!AD2+Score4!BD2+Score5!M2+Score6!AR2+Score7!AA2)*100","v":1.4285714285714286}]

{"sheet":"Score1","index":7,"n_rows":2,"n_cols":41,"rows_kept":2,"cut":false,"hidden":true,"merged":[]}
["CODETAB","FINESS","PREV1","PREV2","PREV3","PREV4","PREV5","PREV6","PREV7","PREV8","PREV9","PREV","DENOMPREV","SURV1","SURV2","SURV3","SURV4","SURV5","SURV6","SURV","DENOMSURV","ATB1","ATB2","ATB","DENOMATB","TENUE1","TENUE2","TENUE3","TENUE4","TENUE5","TENUE6","TENUE7","TENUE","DENOMTENUE","SCORE1A","SCORE1B","SCORE1C","SCORE1D","NUM1","DENOM1","SCORE1"]
[{"$f":"CODE","v":0},{"$f":"FINESS","v":0},{"$f":"IF(CHAPI!C2=1,1,0)","v":0},{"$f":"IF(OR(CHAPI!D2=1,CHAPI!E2=1,CHAPI!F2=1),1,0)","v":0},{"$f":"IF(CHAPI!G2=1,1,0)","v":0},{"$f":"IF(CHAPI!I2=1,1,0)","v":0},{"$f":"IF(CHAPI!J2=1,1,0)","v":0},{"$f":"IF(CHAPI!K2=1,1,0)","v":0},{"$f":"IF(CHAPI!L2=1,1,0)","v":0},{"$f":"IF(CHAPI!M2=1,1,0)","v":0},{"$f":"IF(CHAPI!N2=1,1,0)","v":0},{"$f":"SUM(C2:K2)","v":0},9,{"$f":"IF(CHAPI!O2=1,1,0)","v":0},{"$f":"IF(CHAPI!Q2=1,1,0)","v":0},{"$f":"IF(CHAPI!S2=1,1,0)","v":0},{"$f":"IF(CHAPI!T2=1,1,0)","v":0},{"$f":"IF(CHAPI!U2=1,1,0)","v":0},{"$f":"IF(CHAPI!V2=1,1,0)","v":0},{"$f":"SUM(N2:S2)","v":0},6,{"$f":"IF(CHAPI!AA2=1,1,0)","v":0},{"$f":"IF(CHAPI!AD2=1,1,0)","v":0},{"$f":"SUM(V2:W2)","v":0},2,{"$f":"IF(CHAPI!AE2=1,1,0)","v":0},{"$f":"IF(CHAPI!AF2=1,1,0)","v":0},{"$f":"IF(CHAPI!AJ2=1,1,0)","v":0},{"$f":"IF(CHAPI!AK2=1,1,0)","v":0},{"$f":"IF(CHAPI!AN2=1,1,0)","v":0},{"$f":"IF(CHAPI!AO2=1,1,0)","v":0},{"$f":"IF(CHAPI!AP2=1,1,0)","v":0},{"$f":"SUM(Z2:AF2)","v":0},7,{"$f":"L2/M2*100","v":0},{"$f":"T2/U2*100","v":0},{"$f":"X2/Y2*100","v":0},{"$f":"AG2/AH2*100","v":0},{"$f":"L2+T2+X2+AG2","v":0},{"$f":"M2+U2+Y2+AH2","v":24},{"$f":"AM2/AN2*100","v":0}]

{"sheet":"CHAPI","index":8,"n_rows":2,"n_cols":42,"rows_kept":2,"cut":false,"hidden":true,"merged":[]}
["CODETAB","FINESS","MEDECIN","CONV","RESEAU","INFHYG","REF","RAPPORT","FORMATION","EQUIPE","IDE","SOCIAL","TECHNIQ","ADMIN","PREV","TAUX","BMR","SUIVIBMR","NUTRITION","CAT","MENSUEL","RESSOURCE","ARS","CIRE","CCLIN","ARLIN","ATB","PROTO_ATB","REF_ATB","REEVAL","REGLEMENT","PORT","FOURNITURE","ENTRETIEN","CHANGEMENT","EXTERIEUR","COURTE","DEPASSE","VETEMENT","CHEVEU","BIJOU","ONGLE"]
[{"$f":"CODE","v":0},{"$f":"FINESS","v":0},{"$f":"'Chapitre I'!C11","v":0},{"$f":"'Chapitre I'!C14","v":0},{"$f":"'Chapitre I'!C16","v":0},{"$f":"'Chapitre I'!C18","v":0},{"$f":"'Chapitre I'!C20","v":0},{"$f":"'Chapitre I'!C22","v":0},{"$f":"'Chapitre I'!C24","v":0},{"$f":"'Chapitre I'!C27","v":0},{"$f":"'Chapitre I'!C29","v":0},{"$f":"'Chapitre I'!C31","v":0},{"$f":"'Chapitre I'!C33","v":0},{"$f":"'Chapitre I'!C35","v":0},{"$f":"'Chapitre I'!C40","v":0},{"$f":"'Chapitre I'!C42","v":0},{"$f":"'Chapitre I'!C44","v":0},{"$f":"'Chapitre I'!C46","v":0},{"$f":"'Chapitre I'!C48","v":0},{"$f":"'Chapitre I'!C50","v":0},{"$f":"'Chapitre I'!C52","v":0},{"$f":"'Chapitre I'!C54","v":0},{"$f":"'Chapitre I'!C56","v":0},{"$f":"'Chapitre I'!C58","v":0},{"$f":"'Chapitre I'!C60","v":0},{"$f":"'Chapitre I'!C62","v":0},{"$f":"'Chapitre I'!C67","v":0},{"$f":"'Chapitre I'!C70","v":0},{"$f":"'Chapitre I'!C72","v":0},{"$f":"'Chapitre I'!C74","v":0},{"$f":"'Chapitre I'!C79","v":0},{"$f":"'Chapitre I'!C82","v":0},{"$f":"'Chapitre I'!C84","v":0},{"$f":"'Chapitre I'!C86","v":0},{"$f":"'Chapitre I'!C88","v":0},{"$f":"'Chapitre I'!C90","v":0},{"$f":"'Chapitre I'!C92","v":0},{"$f":"'Chapitre I'!C94","v":0},{"$f":"'Chapitre I'!C96","v":0},{"$f":"'Chapitre I'!C98","v":0},{"$f":"'Chapitre I'!C100","v":0},{"$f":"'Chapitre I'!C102","v":0}]

{"sheet":"EHPAD","index":9,"n_rows":26,"n_cols":9,"rows_kept":26,"cut":false,"hidden":false,"merged":[[2,5,2,6],[3,5,3,6],[2,7,2,8],[3,7,3,8],[24,3,24,4],[25,3,25,4],[11,0,11,8],[15,3,15,4],[16,3,16,4],[17,3,17,4],[18,3,18,4],[19,3,19,4],[20,3,20,4],[23,3,23,4],[21,3,21,4],[22,3,22,4]]}
["Renseigner les cases bleu pâle:",null,null,"Renseigner obligatoirement les cases Bleues"]
[]
["Nom EMS","Adresse","Code postal","Ville","Téléphone","FAX",null,"Mail général"]
[{"$f":"Etablissement!E5","v":0},null,{"$f":"Etablissement!E11","v":0},{"$f":"Etablissement!E13","v":0}]
[]
[]
[null,2018,{"$f":"B7+1","v":2019},{"$f":"C7+1","v":2020},2021,2022,2023,2024,2025]
["Taux d'occupation\n(à renseigner obligatoirement)"]
["Nombre de journées d'hébergement",{"$f":"(B8*Etablissement!$E$24)*365","v":0},{"$f":"(C8*Etablissement!$E$24)*365","v":0},{"$f":"(D8*Etablissement!$E$24)*365","v":0},{"$f":"(E8*Etablissement!$E$24)*365","v":0},{"$f":"(F8*Etablissement!$E$24)*365","v":0},{"$f":"(G8*Etablissement!$E$24)*365","v":0},{"$f":"(H8*Etablissement!$E$24)*365","v":0},{"$f":"(I8*Etablissement!$E$24)*365","v":0}]
["Suivi Global GREPHH\n(à renseigner obligatoirement)"]
[]
["Nombre de Professionnels"]
[null,{"$f":"B7","v":2018},{"$f":"B13+1","v":2019},{"$f":"C13+1","v":2020},2021,2022,2023,2024,2025]
["soignant total (tout salarié en contact avec le résident ou son environnement)\n(à renseigner obligatoirement)"]
[]
[null,"NOM PRENOM","Téléphone","Mail",null,"ANNEE DE PRISE DE FONCTION"]
["Directeur\n(à renseigner obligatoirement)"]
["Médecin coordonateur\n(à renseigner obligatoirement)"]
["IDEC/Cadre\n(à renseigner obligatoirement)"]
["Référent(s) hygiène\n(à renseigner obligatoirement)"]
["Référent Antibiotiques"]
["Responsable Logistique\n(à renseigner obligatoirement)"]
["Médecin du travail\n(à renseigner obligatoirement)"]
["EOHM \n(à renseigner le cas échéant)"]
["Laboratoire"]
["Pharmacie"]

{"sheet":"Chapitre I","index":10,"n_rows":103,"n_cols":2,"rows_kept":103,"cut":false,"hidden":false,"merged":[[0,0,0,2],[1,0,1,2]]}
["CHAPITRE I"]
["ORGANISATION DES MOYENS DE PREVENTION\nDANS L'ETABLISSEMENT"]
[]
[]
["Rappel: ","les données sont à saisir dans les cellules vert pâle. Saisie obligatoire pour tous les critères proposés."]
[null,"Pour certaines questions, lorsqu'une réponse négative est donnée, les questions suivantes apparaissent en gris:"]
[null,"vous n'avez pas à y répondre."]
[]
["I-1 Moyens"]
[]
[null,"Votre établissement bénéficie de la présence d'un médecin coordonnateur"]
[null,"1=Oui, 2=Non"]
[null,"Votre établissement:  "]
[null,"     - a passé une convention avec un établissement de santé"]
[null,"1=Oui, 2=Non"]
[null,"     - travaille en réseau avec une équipe opérationnelle en hygiène d'un établissement de santé"]
[null,"1=Oui, 2=Non"]
[null,"     - dispose d'une infirmière hygiéniste (DU) et/ou d'un praticien hospitalier en hygiène (DU) avec temps dédié à l'activité"]
[null,"1=Oui, 2=Non"]
[null,"Une personne référente hygiène (IDE, AS, …) et/ou relais est en place dans l'établissement"]
[null,"1=Oui, 2=Non"]
[null,"Le rapport annuel médical d'activité comporte un chapitre sur l'hygiène et le risque infectieux"]
[null,"1=Oui, 2=Non"]
[null,"La formation du personnel à la prévention des Infections Associées aux Soins (IAS) en gériatrie est organisée"]
[null,"1=Oui, 2=Non"]
[null,"Si oui, pour:"]
[null,"     - l'équipe médicale (par exemple EPU)"]
[null,"1=Oui, 2=Non"]
[null,"     - IDE et AS et kinésithérapeuthe"]
[null,"1=Oui, 2=Non"]
[null,"     - le personnel médico-social (AMP: Aide Médico-Psychologique)"]
[null,"1=Oui, 2=Non"]
[null,"     - le personnel technique (cuisine hygiène, agent entretien, ASH)"]
[null,"1=Oui, 2=Non"]
[null,"     - l'encadrement administratif"]
[null,"1=Oui, 2=Non"]
[]
["I-2 Surveillance / Alerte / Indicateurs"]
[]
[null,"Vous avez participé à une enquête de prévalence au cours des 3 dernières années"]
[null,"1=Oui, 2=Non"]
[null,"Si oui, indiquez votre taux de résidents infectés (en %)"]
[]
[null,"Une politique de prise en charge des résidents porteurs de BMR a été définie au sein de votre EHPAD"]
[null,"1=Oui, 2=Non"]
[null,"Un suivi des infections à BMR est organisé dans votre établissement"]
[null,"1=Oui, 2=Non"]
[null,"L'état nutritionnel des résidents est évalué dans votre établissement"]
[null,"1=Oui, 2=Non"]
[null,"Une conduite à tenir de prise en charge de résidents présentant une malnutrition protidique et/ou une déshydratation est validée par le médecin coordonnateur"]
[null,"1=Oui, 2=Non"]
[null,"Un suivi de cet état est organisé mensuellement"]
[null,"1=Oui, 2=Non"]
[null,"Vous avez identifié les personnes ressources"]
[null,"1=Oui, 2=Non"]
[null,"     - à l'ARS"]
[null,"1=Oui, 2=Non"]
[null,"     - à la CIRE"]
[null,"1=Oui, 2=Non"]
[null,"     - au CCLIN"]
[null,"1=Oui, 2=Non"]
[null,"     - à l'ARLIN"]
[null,"1=Oui, 2=Non"]
[]
["I-3 Antibiotiques"]
[]
[null,"Une politique antibiotique a été définie sur votre EHPAD par le médecin coordonnateur à destination des médecins prescripteurs"]
[null,"1=Oui, 2=Non"]
[null,"Si oui, "]
[null,"     - des protocoles de prescription existent"]
[null,"1=Oui, 2=Non"]
[null,"     - un référent est identifié"]
[null,"1=Oui, 2=Non"]
[null,"Une réévaluation de prescription des antibiotiques est organisée entre la 48ème et la 72ème heure"]
[null,"1=Oui, 2=Non"]
[]
["I-4 Tenue du personnel dans l'établissement"]
[]
[null,"Le règlement intérieur de l'EHPAD ou document équivalent existe:"]
[null,"1=Oui, 2=Non"]
[null,"Si oui, il prévoit:"]
[null,"   - le port d'une tenue professionnelle pour le personnel salarié de l'établissement"]
[null,"1=Oui, 2=Non"]
[null,"   - la fourniture par l'institution des tenues professionnelles des agents"]
[null,"1=Oui, 2=Non"]
[null,"   - l'entretien par l'institution des tenues professionnelles des agents"]
[null,"1=Oui, 2=Non"]
[null,"   - le changement quotidien de la tenue"]
[null,"1=Oui, 2=Non"]
[null,"   - la mise à disposition d'une tenue professionnelle adaptée à la situation pour les intervenants extérieurs (infirmière libérale, kiné, médecin de ville, podologue, personnel de laboratoire de biologie, …)"]
[null,"1=Oui, 2=Non"]
[null,"   - une tenue à manches courtes"]
[null,"1=Oui, 2=Non"]
[null,"   - l'absence de vêtement dépassant de la tenue"]
[null,"1=Oui, 2=Non"]
[null,"   - l'absence de vêtement personnel sur la tenue au cours de l'activité de soins"]
[null,"1=Oui, 2=Non"]
[null,"   - les cheveux longs attachés et maintenus"]
[null,"1=Oui, 2=Non"]
[null,"   - l'absence de bijoux (mains et poignets)"]
[null,"1=Oui, 2=Non"]
[null,"   - les ongles courts et sans vernis, sans faux ongles"]
[null,"1=Oui, 2=Non"]

{"sheet":"Score2","index":11,"n_rows":2,"n_cols":119,"rows_kept":2,"cut":false,"hidden":true,"merged":[]}
["CODETAB","FINESS","LOCAUX1","LOCAUX2","LOCAUX3","LOCAUX4","LOCAUX5","LOCAUX6","LOCAUX7","LOCAUX8","LOCAUX9","LOCAUX10","LOCAUX11","LOCAUX12","LOCAUX","DENOMLOCAUX7","DENOMLOCAUX","RESTO1","RESTO2CH","RESTO3CH","RESTO2FR","RESTO3FR","RESTO3bisFR","RESTO4","RESTO5","RESTO6","RESTO7","RESTO8","RESTO9","RESTO10","RESTO11","RESTO12","RESTO13","RESTO14","RESTO15","RESTO","DENOMRESTO10","DENOMRESTO11","DENOMRESTO12","DENOMRESTO13","DENOMRESTO14","DENOMRESTO","LINGE1","LINGE2","LINGE3","LINGE4","LINGE5","LINGE6","LINGE7","LINGE8","LINGE9","LINGE10","LINGE","DENOMLINGE","DECH1","DECH2","DECH3","DECH4","DASRISEM","DECH5","DECH6","DECH7","DECH","DENOMDECH","EAU1","EAU2","EAU3","EAU4","EAU5","EAU6","EAU7","EAU8","EAU9","EAU10","EAU11","EAU12","EAU13","EAU14","EAU15","EAU16","EAU17","EAU18","EAU19","EAU20","EAU21","EAU22","EAU23","EAU24","EAU25","EAU26","EAU27","EAU28","EAU29","EAU30","EAU31","EAU32","EAU33","EAU","DENOMEAU3","DENOMEAU4","DENOMEAU5","DENOMEAU6","DENOMEAU12","DENOMEAU13","DENOMEAU26","DENOMEAU27","DENOMEAU28","DENOMEAU29","DENOMEAU30","DENOMEAU31","DENOMEAU","SCORE2A","SCORE2B","SCORE2C","SCORE2D","SCORE2E","NUM2","DENOM2","SCORE2"]
[{"$f":"CODE","v":0},{"$f":"FINESS","v":0},{"$f":"IF(CHAPII!C2=1,1,0)","v":0},{"$f":"IF(AND(CHAPII!D2=1,CHAPII!E2=1,CHAPII!F2=1),1,0)","v":0},{"$f":"IF(CHAPII!G2=1,1,0)","v":0},{"$f":"IF(CHAPII!I2=1,1,0)","v":0},{"$f":"IF(CHAPII!J2=1,1,0)","v":0},{"$f":"IF(CHAPII!K2=1,1,0)","v":0},{"$f":"IF(CHAPII!L2=1,1,0)","v":0},{"$f":"IF(CHAPII!M2=1,1,0)","v":0},{"$f":"IF(CHAPII!N2=1,1,0)","v":0},{"$f":"IF(OR(CHAPII!O2=1,CHAPII!P2=1,CHAPII!Q2=1),1,0)","v":0},{"$f":"IF(CHAPII!S2=1,1,0)","v":0},{"$f":"IF(AND(CHAPII!T2=1,CHAPII!U2=1,CHAPII!V2=1,CHAPII!W2=1),1,0)","v":0},{"$f":"SUM(C2:N2)","v":0},{"$f":"IF(CHAPII!L2=3,0,1)","v":1},{"$f":"11+P2","v":12},{"$f":"IF(CHAPII!Y2=1,1,0)","v":0},{"$f":"IF(AND(CHAPII!Z2=1,CHAPII!AA2=1),1,0)","v":0},{"$f":"IF(AND(CHAPII!Z2=1,CHAPII!AB2=1),1,0)","v":0},{"$f":"IF(AND(CHAPII!$Z$2=2,CHAPII!AC2=1),1,0)","v":0},{"$f":"IF(AND(CHAPII!$Z$2=2,CHAPII!AD2=1),1,0)","v":0},{"$f":"IF(AND(CHAPII!$Z$2=2,CHAPII!AE2=1),1,0)","v":0},{"$f":"IF(CHAPII!AF2=1,1,0)","v":0},{"$f":"IF(CHAPII!AG2=1,1,0)","v":0},{"$f":"IF(CHAPII!AH2=1,1,0)","v":0},{"$f":"IF(CHAPII!AJ2=1,1,0)","v":0},{"$f":"IF(CHAPII!AK2=1,1,0)","v":0},{"$f":"IF(CHAPII!AL2=1,1,0)","v":0},{"$f":"IF(CHAPII!AM2=1,1,0)","v":0},{"$f":"IF(CHAPII!AN2=1,1,0)","v":0},{"$f":"IF(CHAPII!AP2=1,1,0)","v":0},{"$f":"IF(CHAPII!AR2=1,1,0)","v":0},{"$f":"IF(CHAPII!AT2=1,1,0)","v":0},{"$f":"IF(CHAPII!AV2=1,1,0)","v":0},{"$f":"IF(CHAPII!Z2=1,R2+S2+T2+X2+Y2+Z2+AA2+AB2+AC2+AD2+AE2+AF2+AG2+AH2+AI2,R2+U2+V2+W2+X2+Y2+Z2+AA2+AB2+AC2+AD2+AE2+AF2+AG2+AH2+AI2)","v":0},{"$f":"IF(CHAPII!AM2=3,0,1)","v":1},{"$f":"IF(CHAPII!AN2=3,0,1)","v":1},{"$f":"IF(CHAPII!AP2=3,0,1)","v":1},{"$f":"IF(CHAPII!AR2=3,0,1)","v":1},{"$f":"IF(CHAPII!AT2=3,0,1)","v":1},{"$f":"IF(CHAPII!Z2=1,10+AK2+AL2+AM2+AN2+AO2,AK2+AL2+AM2+AN2+AO2+11)","v":16},{"$f":"IF(CHAPII!AZ2=1,1,0)","v":1},{"$f":"IF(AND(CHAPII!BA2=1,CHAPII!BB2=1,CHAPII!BC2=1),1,0)","v":1},{"$f":"IF(OR(CHAPII!BD2=1,CHAPII!BE2=1),1,0)","v":0},{"$f":"IF(CHAPII!BF2=1,1,0)","v":0},{"$f":"IF(CHAPII!BG2=1,1,0)","v":1},{"$f":"IF(AND(CHAPII!BH2=1,CHAPII!BI2=1,CHAPII!BJ2=1),1,0)","v":0},{"$f":"IF(CHAPII!BK2=1,1,0)","v":0},{"$f":"IF(CHAPII!BL2=1,1,0)","v":0},{"$f":"IF(AND(CHAPII!BN2=1,CHAPII!BO2=1,CHAPII!BP2=1),1,0)","v":0},{"$f":"IF(CHAPII!BQ2=1,1,0)","v":0},{"$f":"SUM(AQ2:AZ2)","v":3},10,{"$f":"IF(CHAPII!BU2=1,1,0)","v":0},{"$f":"IF(AND(CHAPII!BV2=1,CHAPII!BW2=1,CHAPII!BX2=1),1,0)","v":0},{"$f":"IF(CHAPII!BY2=1,1,0)","v":0},{"$f":"IF(AND(CHAPII!BZ2=1,CHAPII!CA2=1,CHAPII!CB2=1,CHAPII!CC2=1),1,0)","v":0},{"$f":"IF(CHAPII!CD2<>\"\",CHAPII!CD2/31*7,0)","v":0},{"$f":"IF(OR(AND(BG$2:BG$65536>100,CHAPII!CE2<4),AND(BG$2:BG$65536>0,BG$2:BG$65536<1.13,CHAPII!CE2<91),AND(BG$2:BG$65536>1.14,BG$2:BG$65536<=100,CHAPII!CE2<8)),1,0)","v":0},{"$f":"IF(AND(CHAPII!CF2=1,CHAPII!CG2=1,CHAPII!CH2=1),1,0)","v":0},{"$f":"IF(AND(CHAPII!CI2=1,CHAPII!CJ2=1,CHAPII!CK2=1,CHAPII!CL2=1),1,0)","v":0},{"$f":"BC2+BD2+BE2+BF2+BH2+BI2+BJ2","v":0},7,{"$f":"IF(CHAPII!CM2=1,1,0)","v":0},{"$f":"IF(CHAPII!CO2=1,1,0)","v":0},{"$f":"IF(CHAPII!CP2=1,1,0)","v":0},{"$f":"IF(CHAPII!CQ2=1,1,0)","v":0},{"$f":"IF(CHAPII!CR2=1,1,0)","v":0},{"$f":"IF(CHAPII!CS2=1,1,0)","v":0},{"$f":"IF(CHAPII!CT2=1,1,0)","v":0},{"$f":"IF(CHAPII!CV2=1,1,0)","v":0},{"$f":"IF(CHAPII!CW2=1,1,0)","v":0},{"$f":"IF(CHAPII!CX2=1,1,0)","v":0},{"$f":"IF(CHAPII!CY2=1,1,0)","v":0},{"$f":"IF(CHAPII!CZ2=1,1,0)","v":0},{"$f":"IF(CHAPII!DA2=1,1,0)","v":0},{"$f":"IF(CHAPII!DB2=1,1,0)","v":0},{"$f":"IF(CHAPII!DC2=1,1,0)","v":0},{"$f":"IF(CHAPII!DD2=1,1,0)","v":0},{"$f":"IF(CHAPII!DE2=1,1,0)","v":0},{"$f":"IF(CHAPII!DF2=1,1,0)","v":0},{"$f":"IF(CHAPII!DG2=1,1,0)","v":0},{"$f":"IF(CHAPII!DH2=1,1,0)","v":0},{"$f":"IF(CHAPII!DI2=1,1,0)","v":0},{"$f":"IF(CHAPII!DJ2=1,1,0)","v":0},{"$f":"IF(CHAPII!DK2=1,1,0)","v":0},{"$f":"IF(CHAPII!DL2=1,1,0)","v":0},{"$f":"IF(CHAPII!DM2=1,1,0)","v":0},{"$f":"IF(CHAPII!DO2=1,1,0)","v":0},{"$f":"IF(CHAPII!DP2=1,1,0)","v":0},{"$f":"IF(CHAPII!DR2=1,1,0)","v":0},{"$f":"IF(CHAPII!DS2=1,1,0)","v":0},{"$f":"IF(CHAPII!DT2=1,1,0)","v":0},{"$f":"IF(AND(CHAPII!DV2=1,CHAPII!DW2=1),1,0)","v":0},{"$f":"IF(CHAPII!DX2=1,1,0)","v":0},{"$f":"IF(CHAPII!DY2=1,1,0)","v":0},{"$f":"SUM(BM2:CS2)","v":0},{"$f":"IF(CHAPII!CP2=3,0,1)","v":1},{"$f":"IF(CHAPII!CQ2=3,0,1)","v":1},{"$f":"IF(CHAPII!CR2=3,0,1)","v":1},{"$f":"IF(CHAPII!CS2=3,0,1)","v":1},{"$f":"IF(CHAPII!CZ2=3,0,1)","v":1},{"$f":"IF(CHAPII!DA2=3,0,1)","v":1},{"$f":"IF(CHAPII!$DN$2=2,0,1)","v":1},{"$f":"IF(CHAPII!$DN$2=2,0,1)","v":1},{"$f":"IF(CHAPII!$DQ$2=2,0,1)","v":1},{"$f":"IF(CHAPII!$DQ$2=2,0,1)","v":1},{"$f":"IF(CHAPII!$DQ$2=2,0,1)","v":1},{"$f":"IF(CHAPII!DU2=2,0,1)","v":1},{"$f":"SUM(CU2:DF2,21)","v":33},{"$f":"O2/Q2*100","v":0},{"$f":"AJ2/AP2*100","v":0},{"$f":"BA2/BB2*100","v":30},{"$f":"BK2/BL2*100","v":0},{"$f":"CT2/DG2*100","v":0},{"$f":"O2+AJ2+BA2+BK2+CT2","v":3},{"$f":"Q2+AP2+BB2+BL2+DG2","v":78},{"$f":"DM2/DN2*100","v":3.8461538461538463}]

{"sheet":"CHAPII","index":12,"n_rows":2,"n_cols":129,"rows_kept":2,"cut":false,"hidden":true,"merged":[]}
["CODETAB","FINESS","PROTLOC","PROTVAL","PROTDIF","EVAL","NETQUOT","NETTRIM","NETAPP","NETSANIT","NETRESTO","BUREAU","SALLE","TRACALOC","DETER","DESINF","VAPEUR","LISTE","CHARIOT","BANDEAU","BALAI","CHIFFON","PRODUIT","AUDIT","HACCP","LIAISON","CHAUD63","CHAUD8","FROID3","FROID8","FROID63","THERMO","TEMPREFRIG","TEMPCAT","PROTDISTR","AGENTS","RESID","PROTECTION","CHAR","REFRIG","FREQREFR","MICRO","FREQMICRO","LAIT","FREQLAIT","BOUILL","FREQBOU","DYSF","TIAC","ATELIER","BLANCHIS","PROCPROPRE","PROPRVAL","PROPRDIF","PROPREVAL","FILM","FERME","MAINS","PROCSALE","SALEVAL","SALEDIF","SALEVAL","TRI","CONDIT","STOCK","GANTS","HYGMAIN","TENUE","MOYENS","ARMOIRE","SACS","MATERIEL","PROCDECH","DECHVAL","DECHDIF","DECHEVAL","RESP","TRIOM","CONDITOM","STOCKAGE","TRANSPORT","DASRI","DELAI","PORT","HYGIENE","TENUEDECH","SACSOM","SACSDASRI","COLLOPCT","MATPROTEC","LEGION","LABO","POINTS","USAGE","SENSIB","CORRECT","NORMAL","CARNET","AUDITEAU","CARTO","SUIVI","TRAVAUX","MAINTENANCE","TARTRE","ROBINET","ANALYSE","CIRCULAIRE","ARRETE","PURGE","RELEVE","FICHE","CONDUITE","INFO","LEGRESID","ACTION","DECLARATION","POTABILITE","BOUTEILLE","DATELIMIT","LIEU","FONTAINE","PRELEVEM","ENTRETIEN","CIRCUIT","BOMBONNE","CAHIER","SOCIETE","PROCED","SYSTEM"]
[{"$f":"CODE","v":0},{"$f":"FINESS","v":0},{"$f":"'Chapitre II'!C13","v":0},{"$f":"'Chapitre II'!C16","v":0},{"$f":"'Chapitre II'!C18","v":0},{"$f":"'Chapitre II'!C20","v":0},{"$f":"'Chapitre II'!C23","v":0},{"$f":"'Chapitre II'!C25","v":0},{"$f":"'Chapitre II'!C27","v":0},{"$f":"'Chapitre II'!C29","v":0},{"$f":"'Chapitre II'!C31","v":0},{"$f":"'Chapitre II'!C33","v":0},{"$f":"'Chapitre II'!C35","v":0},{"$f":"'Chapitre II'!C38","v":0},{"$f":"'Chapitre II'!C41","v":0},{"$f":"'Chapitre II'!C43","v":0},{"$f":"'Chapitre II'!C45","v":0},{"$f":"'Chapitre II'!C47","v":0},{"$f":"'Chapitre II'!C50","v":0},{"$f":"'Chapitre II'!C53","v":0},{"$f":"'Chapitre II'!C55","v":0},{"$f":"'Chapitre II'!C57","v":0},{"$f":"'Chapitre II'!C59","v":0},{"$f":"'Chapitre II'!C64","v":0},{"$f":"'Chapitre II'!C66","v":0},{"$f":"'Chapitre II'!C68","v":0},{"$f":"'Chapitre II'!C71","v":0},{"$f":"'Chapitre II'!C73","v":0},{"$f":"'Chapitre II'!C77","v":0},{"$f":"'Chapitre II'!C79","v":0},{"$f":"'Chapitre II'!C81","v":0},{"$f":"'Chapitre II'!C83","v":0},{"$f":"'Chapitre II'!C85","v":0},{"$f":"'Chapitre II'!C87","v":0},{"$f":"'Chapitre II'!C89","v":0},{"$f":"'Chapitre II'!C93","v":0},{"$f":"'Chapitre II'!C95","v":0},{"$f":"'Chapitre II'!C97","v":0},{"$f":"'Chapitre II'!C101","v":0},{"$f":"'Chapitre II'!C103","v":0},{"$f":"'Chapitre II'!B106","v":0},{"$f":"'Chapitre II'!C108","v":0},{"$f":"'Chapitre II'!B111","v":0},{"$f":"'Chapitre II'!C113","v":0},{"$f":"'Chapitre II'!B116","v":0},{"$f":"'Chapitre II'!C118","v":0},{"$f":"'Chapitre II'!B121","v":0},{"$f":"'Chapitre II'!C123","v":0},{"$f":"'Chapitre II'!C125","v":0},{"$f":"'Chapitre II'!C127","v":0},{"$f":"'Chapitre II'!C132","v":1},{"$f":"'Chapitre II'!C137","v":1},{"$f":"'Chapitre II'!C140","v":1},{"$f":"'Chapitre II'!C142","v":1},{"$f":"'Chapitre II'!C144","v":1},{"$f":"'Chapitre II'!C147","v":0},{"$f":"'Chapitre II'!C149","v":0},{"$f":"'Chapitre II'!C151","v":0},{"$f":"'Chapitre II'!C156","v":1},{"$f":"'Chapitre II'!C159","v":1},{"$f":"'Chapitre II'!C161","v":0},{"$f":"'Chapitre II'!C163","v":0},{"$f":"'Chapitre II'!C166","v":0},{"$f":"'Chapitre II'!C168","v":0},{"$f":"'Chapitre II'!C170","v":0},{"$f":"'Chapitre II'!C173","v":0},{"$f":"'Chapitre II'!C175","v":0},{"$f":"'Chapitre II'!C177","v":0},{"$f":"'Chapitre II'!C179","v":0},{"$f":"'Chapitre II'!C181","v":0},{"$f":"'Chapitre II'!C183","v":0},{"$f":"'Chapitre II'!C185","v":0},{"$f":"'Chapitre II'!C190","v":0},{"$f":"'Chapitre II'!C193","v":0},{"$f":"'Chapitre II'!C195","v":0},{"$f":"'Chapitre II'!C197","v":0},{"$f":"'Chapitre II'!C199","v":0},{"$f":"'Chapitre II'!C202","v":0},{"$f":"'Chapitre II'!C204","v":0},{"$f":"'Chapitre II'!C206","v":0},{"$f":"'Chapitre II'!C208","v":0},{"$f":"IF('Chapitre II'!C211=\"\",\"\",'Chapitre II'!C211)","v":""},{"$f":"IF('Chapitre II'!C213=\"\",\"\",'Chapitre II'!C213)","v":""},{"$f":"'Chapitre II'!C216","v":0},{"$f":"'Chapitre II'!C218","v":0},{"$f":"'Chapitre II'!C220","v":0},{"$f":"'Chapitre II'!C223","v":0},{"$f":"'Chapitre II'!C225","v":0},{"$f":"'Chapitre II'!C227","v":0},{"$f":"'Chapitre II'!C229","v":0},{"$f":"'Chapitre II'!C236","v":0},{"$f":"'Chapitre II'!C238","v":0},{"$f":"'Chapitre II'!C240","v":0},{"$f":"'Chapitre II'!C243","v":0},{"$f":"'Chapitre II'!C245","v":0},{"$f":"'Chapitre II'!C247","v":0},{"$f":"'Chapitre II'!C249","v":0},{"$f":"'Chapitre II'!C252","v":0},{"$f":"'Chapitre II'!C255","v":0},{"$f":"'Chapitre II'!C257","v":0},{"$f":"'Chapitre II'!C259","v":0},{"$f":"'Chapitre II'!C261","v":0},{"$f":"'Chapitre II'!C263","v":0},{"$f":"'Chapitre II'!C265","v":0},{"$f":"'Chapitre II'!C267","v":0},{"$f":"'Chapitre II'!C269","v":0},{"$f":"'Chapitre II'!C271","v":0},{"$f":"'Chapitre II'!C273","v":0},{"$f":"'Chapitre II'!C275","v":0},{"$f":"'Chapitre II'!C277","v":0},{"$f":"'Chapitre II'!C279","v":0},{"$f":"'Chapitre II'!C282","v":0},{"$f":"'Chapitre II'!C284","v":0},{"$f":"'Chapitre II'!C287","v":0},{"$f":"'Chapitre II'!C289","v":0},{"$f":"'Chapitre II'!C291","v":0},{"$f":"'Chapitre II'!C296","v":0},{"$f":"'Chapitre II'!C298","v":0},{"$f":"'Chapitre II'!C300","v":0},{"$f":"'Chapitre II'!C302","v":0},{"$f":"'Chapitre II'!C304","v":0},{"$f":"'Chapitre II'!C306","v":0},{"$f":"'Chapitre II'!C308","v":0},{"$f":"'Chapitre II'!C310","v":0},{"$f":"'Chapitre II'!C312","v":0},{"$f":"'Chapitre II'!C314","v":0},{"$f":"'Chapitre II'!C316","v":0},{"$f":"'Chapitre II'!C319","v":0},{"$f":"'Chapitre II'!C321","v":0}]

{"sheet":"Eval 1","index":13,"n_rows":141,"n_cols":17,"rows_kept":141,"cut":false,"hidden":false,"merged":[[0,2,0,3],[25,0,29,0],[2,0,2,1],[3,0,9,0],[10,0,18,0],[19,0,24,0]]}
[null,"Renseigner les cases bleu pâle:",null,null,null,"Renseigner obligatoirement"]
[]
["Organisation des moyens de prévention dans létablissement",null,"Fréquence","Gravité","Risque  ","Actions Proposées en comité de pilotage","Validation",null,"Suivi autoévaluation GREPHH\n(à renseigner obligatoirement)",{"$f":"EHPAD!B7","v":2018},{"$f":"J3+1","v":2019},{"$f":"K3+1","v":2020},2021,2022,2023,2024,2025]
["Moyens","Défaut de formation des soignants",1,3,{"$f":"IF(OR(AND(C4<=3,D4=1),AND(C4=1,D4=2),AND(C4=1,D4=3)),\"Risque faible\",IF(OR(AND(C4=4,D4=1),AND(C4=3,D4=2),AND(C4=2,D4=2),AND(C4=2,D4=3),AND(C4=1,D4=4)),\"Risque moyen\",IF(OR(AND(C4=4,D4=2),AND(C4=3,D4=3),AND(C4=4,D4=3),AND(C4=2,D4=4),AND(C4=3,D4=4),AND(C4=4,D4=4)),\"Risque élevé\",\" \")))","v":"Risque faible"},"Formation des nouveaux embauchés par le référent hygiène",null,null,"Moyens"]
[null,"Défaut de formation des personnels/prestataires intervenant dans le cadre des fonctions logistiques, techniques ",1,2,{"$f":"IF(OR(AND(C5<=3,D5=1),AND(C5=1,D5=2),AND(C5=1,D5=3)),\"Risque faible\",IF(OR(AND(C5=4,D5=1),AND(C5=3,D5=2),AND(C5=2,D5=2),AND(C5=2,D5=3),AND(C5=1,D5=4)),\"Risque moyen\",IF(OR(AND(C5=4,D5=2),AND(C5=3,D5=3),AND(C5=4,D5=3),AND(C5=2,D5=4),AND(C5=3,D5=4),AND(C5=4,D5=4)),\"Risque élevé\",\" \")))","v":"Risque faible"},"Organiser une formation pour les services logistiques et techniques ou vérifier l'attestation de formation",null,null,"surveillance / Alerte / indicateurs"]
[null,"Absence de référent hygiène autre que l'IDEC",1,2,"Risque faible","Nommer un référent hygiène autre que l'IDEC (IDE et AS)",null,null,"Antibiotiques"]
[null,"Défaut de formation des référents en hygiène",1,2,"Risque faible","Organiser la formation des référents hygiène avec l'EMH/IMH",null,null,"tenue du personnel"]
[null,"Défaut de mise à disposition des procédures",1,3,"Risque faible","Mettre les procédures à disposition des soignants",null,null,"Global Moyen"]
[null,"Texte libre Moyens 1",1,1,"Risque faible","Texte libre Moyens 1"]
[null,"Texte libre Moyens 2",1,1,"Risque faible","Texte libre Moyens 2",null,null,"Suivi formation soignants",{"$f":"J3","v":2018},{"$f":"J10+1","v":2019},{"$f":"K10+1","v":2020},2021,2022,2023,2024,2025]
["Surveillance/ Alerte / Indicateurs","Défaut de signalement interne des IAS",1,3,"Risque faible","Resensibiliser le personnel aux déclarations des IAS",null,null,"Nb soignants Formés/hygiène des mains/3 dernières années\n(à renseigner obligatoirement)"]
[null,"Défaut d'identification anticipée avant l'admission des résidents porteurs de BMR/BHRe",1,3,"Risque faible","Intégrer le statut infectieux au dossier de demande d'admission",null,null,"Taux de soignants formés à l'hygiène des mains dans les 3 dernières années",{"$f":"J11/EHPAD!B14","v":{"$error":"#DIV/0!"}},{"$f":"K11/EHPAD!C14","v":{"$error":"#DIV/0!"}},{"$f":"L11/EHPAD!D14","v":{"$error":"#DIV/0!"}},{"$f":"M11/EHPAD!E14","v":{"$error":"#DIV/0!"}},{"$f":"N11/EHPAD!F14","v":{"$error":"#DIV/0!"}},{"$f":"O11/EHPAD!G14","v":{"$error":"#DIV/0!"}},{"$f":"P11/EHPAD!H14","v":{"$error":"#DIV/0!"}},{"$f":"Q11/EHPAD!I14","v":{"$error":"#DIV/0!"}}]
[null,"Défaut de signalement interne des colonisations à BMR/BHRe",1,3,"Risque faible","Identifier le portage BMR/BHRe dans le dossier patient avec une signalétique non stigmatisante (à inventer en groupe de travail soignants), signalétique dans le plan de soins",null,null,"Nb soignants formés/Précautions standard dont la  Gestion des excréta/3 dernières années\n(à renseigner obligatoirement)"]
[null,"Défaut de signalisation du risque BMR/BHRe dans les courriers de liaison vers l'extérieur",1,3,"Risque faible","Mettre en place les informations sur le statut infectieux du patient dans le DLU (portage au moins plusieurs mois des BMR lorsque les résidents sont identifiés)",null,null,"Taux de soignants formés aux PS/Gestion des excréta dans les 3 dernières années",{"$f":"J13/EHPAD!B14","v":{"$error":"#DIV/0!"}},{"$f":"K13/EHPAD!C14","v":{"$error":"#DIV/0!"}},{"$f":"L13/EHPAD!D14","v":{"$error":"#DIV/0!"}},{"$f":"M13/EHPAD!E14","v":{"$error":"#DIV/0!"}},{"$f":"N13/EHPAD!F14","v":{"$error":"#DIV/0!"}},{"$f":"O13/EHPAD!G14","v":{"$error":"#DIV/0!"}},{"$f":"P13/EHPAD!H14","v":{"$error":"#DIV/0!"}},{"$f":"Q13/EHPAD!I14","v":{"$error":"#DIV/0!"}}]
[null,"Défaut de signalement externe des IAS à l'ARS",1,3,"Risque faible","Signaler toute épidémie IRAB GEA ou gale, légionellose ou tuberculose...à l'ARS",null,null,"Nb soignants formés/PCH / 3 dernières années"]
[null,"Défaut d'information du résident ou sa famille en cas d'IAS",1,2,"Risque faible","Prévoir l'information des résidents et de  leurs familles à l'aide des fiches d'information  CPias  en cas d'IAS ou de colonnisation BMR/BHRe",null,null,"Taux de soignants formésPCH / 3 dernières années",{"$f":"J15/EHPAD!B14","v":{"$error":"#DIV/0!"}},{"$f":"K15/EHPAD!C14","v":{"$error":"#DIV/0!"}},{"$f":"L15/EHPAD!D14","v":{"$error":"#DIV/0!"}},{"$f":"M15/EHPAD!E14","v":{"$error":"#DIV/0!"}},{"$f":"N15/EHPAD!F14","v":{"$error":"#DIV/0!"}},{"$f":"O15/EHPAD!G14","v":{"$error":"#DIV/0!"}},{"$f":"P15/EHPAD!H14","v":{"$error":"#DIV/0!"}},{"$f":"Q15/EHPAD!I14","v":{"$error":"#DIV/0!"}}]
[null,"Défaut de repérage des troubles de la déglutition",1,3,"Risque faible","Rédiger une procédure de dépistage et de CAT en cas de troubles de déglutition",null,null,"Nb soignants formés /autre /3 dernières années"]
[null,"Texte libre Signalement Alerte Indicateurs 1",1,2,"Risque faible","Texte libre Signalement Alerte Indicateurs 1",null,null,"Taux de soignants formés / autre / 3 dernières années",{"$f":"J17/EHPAD!B14","v":{"$error":"#DIV/0!"}},{"$f":"K17/EHPAD!C14","v":{"$error":"#DIV/0!"}},{"$f":"L17/EHPAD!D14","v":{"$error":"#DIV/0!"}},{"$f":"M17/EHPAD!E14","v":{"$error":"#DIV/0!"}},{"$f":"N17/EHPAD!F14","v":{"$error":"#DIV/0!"}},{"$f":"O17/EHPAD!G14","v":{"$error":"#DIV/0!"}},{"$f":"P17/EHPAD!H14","v":{"$error":"#DIV/0!"}},{"$f":"Q17/EHPAD!I14","v":{"$error":"#DIV/0!"}}]
[null,"Texte libre Signalement Alerte Indicateurs 2",1,2,"Risque faible","Texte libre Signalement Alerte Indicateurs 2",null,null,"* élément de preuve = attestations de formation et feuille de présence"]
["Antibiotiques","Mésusage des antibiotiques par rapport aux dernières recommandations de la SPILF",1,3,"Risque faible","Programmer une information à destination des médecins traitant sur le bon usage des antibiotiques en commission gériatrique",null,null,"Suivi BMR / BHRe (nombre de résidents colonisés)\n(à renseigner obligatoirement)",{"$f":"J10","v":2018},{"$f":"J20+1","v":2019},{"$f":"K20+1","v":2020},2021,2022,2023,2024,2025]
[null,"Défaut de réévaluation de l'antibiothérapie à 48/72h",1,3,"Risque faible","Faire un groupe de travail IDE Medco IDEC en lien avec les médecins traitants  pour organiser la réévaluation des ATB à 48-72h (réception ECBU, fiche de suivi clinique IDE à faxer au médecin traitant...). Possibilité de mettre en place ne alerte informatique de rappel sur le logiciel de soins",null,null,"Nbre BMR"]
[null,"Difficultés à faire passer le message sur l'absence d'indication des antibiotiques dans certains cas",1,3,"Risque faible","Faire une campagne d'affichage sur le bon usage des antibiotiques à l'aide des outils OMEDIT",null,null,"Taux BMR",{"$f":"J21/(Etablissement!$E$24*EHPAD!B8)","v":{"$error":"#DIV/0!"}},{"$f":"K21/(Etablissement!$E$24*EHPAD!C8)","v":{"$error":"#DIV/0!"}},{"$f":"L21/(Etablissement!$E$24*EHPAD!D8)","v":{"$error":"#DIV/0!"}},{"$f":"M21/(Etablissement!$E$24*EHPAD!E8)","v":{"$error":"#DIV/0!"}},{"$f":"N21/(Etablissement!$E$24*EHPAD!F8)","v":{"$error":"#DIV/0!"}},{"$f":"O21/(Etablissement!$E$24*EHPAD!G8)","v":{"$error":"#DIV/0!"}},{"$f":"P21/(Etablissement!$E$24*EHPAD!H8)","v":{"$error":"#DIV/0!"}},{"$f":"Q21/(Etablissement!$E$24*EHPAD!I8)","v":{"$error":"#DIV/0!"}}]
[null,"Examens bactériologiques réalisés à l'initiative des soignants sans signe clinique",1,3,"Risque faible","Organiser une formation des soignants sur le rôle propre soignant concernant le bon usage des antibiotiques (outil Kit ATB onglet outil 1)",null,null,"Nbre BHRe"]
[null,"Texte libre Antibiothérapie 1",1,3,"Risque faible","Texte libre Antibiothérapie 1",null,null,"Taux BHRe",{"$f":"J23/(Etablissement!$E$24*EHPAD!B8)","v":{"$error":"#DIV/0!"}},{"$f":"K23/(Etablissement!$E$24*EHPAD!C8)","v":{"$error":"#DIV/0!"}},{"$f":"L23/(Etablissement!$E$24*EHPAD!D8)","v":{"$error":"#DIV/0!"}},{"$f":"M23/(Etablissement!$E$24*EHPAD!E8)","v":{"$error":"#DIV/0!"}},{"$f":"N23/(Etablissement!$E$24*EHPAD!F8)","v":{"$error":"#DIV/0!"}},{"$f":"O23/(Etablissement!$E$24*EHPAD!G8)","v":{"$error":"#DIV/0!"}},{"$f":"P23/(Etablissement!$E$24*EHPAD!H8)","v":{"$error":"#DIV/0!"}},{"$f":"Q23/(Etablissement!$E$24*EHPAD!I8)","v":{"$error":"#DIV/0!"}}]
[null,"Texte libre Antibiothérapie 2",1,3,"Risque faible","Texte libre Antibiothérapie 2"]
["Tenue","Défaut d'observance du règlement intérieur concernant la tenue de travail",1,3,"Risque faible","Rappeler aux soignants et professionnels extérieurs les règles d'hygiène de la tenue professionnelle"]
[null,"Défaut du nombre de tenue allouées aux personnels pour permettre son changement quotidien ",1,3,"Risque faible","Augmenter le nombre de tenues par soignant pour permettre le changement quotidien de la tenue"]
[null,"Défaut d'observance du règlement intérieur concernant le port de bijou et l'absence de vernis ou de faux ongles",1,3,"Risque faible","Réaliser des audits zéro bijou réguliers auprès des soignants, paramédicaux et intervenants de l'extérieur, afin de promouvoir une hygiène des mains de qualité"]
[null,"Texte libre Tenue 1",1,1,"Risque faible","Texte libre Tenue 1"]
[null,"Texte libre Tenue 2",1,1,"Risque faible","Texte libre Tenue 2"]
[null,null,null,null,{"$f":"IF(OR(AND(C31<=3,D31=1),AND(C31=1,D31=2),AND(C31=1,D31=3)),\"Risque faible\",IF(OR(AND(C31=4,D31=1),AND(C31=3,D31=2),AND(C31=2,D31=2),AND(C31=2,D31=3),AND(C31=1,D31=4)),\"Risque moyen\",IF(OR(AND(C31=4,D31=2),AND(C31>=3,D31=3),AND(C31>=2,D31=4)),\"Risque élevé\",\" \")))","v":" "}]
[null,null,null,null," "]
[null,null,null,null," "]
[null,null,null,null," "]
[]
[null,null,null,null," "]
[null,null,null,null," "]
[null,null,null,null," "]
[null,null,null,null," "]
[null,null,null,null,{"$f":"IF(OR(AND(C40<=3,D40=1),AND(C40=1,D40=2),AND(C40=1,D40=3)),\"Risque faible\",IF(OR(AND(C40=4,D40=1),AND(C40=3,D40=2),AND(C40=2,D40=2),AND(C40=2,D40=3),AND(C40=1,D40=4)),\"Risque moyen\",IF(OR(AND(C40=4,D40=2),AND(C40>=3,D40=3),AND(C40>=2,D40=4)),\"Risque élevé\",\" \")))","v":" "}]
[null,null,null,null," "]
[null,null,null,null," "]
[null,null,null,null," "]
[null,null,null,null," "]
[null,null,null,null," "]
[null,null,null,null," "]
[null,null,null,null," "]
[null,null,null,null," "]
[null,null,null,null," "]
[null,null,null,null," "]
[null,null,null,null," "]
[null,null,null,null," "]
[null,null,null,null," "]
[null,null,null,null," "]
[null,null,null,null," "]
[null,null,null,null," "]
[null,null,null,null," "]
[null,null,null,null," "]
[null,null,null,null," "]
[null,null,null,null," "]
[null,null,null,null," "]
[null,null,null,null," "]
[null,null,null,null," "]
[null,null,null,null," "]
[null,null,null,null," "]
[null,null,null,null," "]
[null,null,null,null," "]
[null,null,null,null," "]
[null,null,null,null," "]
[null,null,null,null," "]
[null,null,null,null," "]
[null,null,null,null," "]
[null,null,null,null," "]
[null,null,null,null," "]
[null,null,null,null," "]
[null,null,null,null," "]
[null,null,null,null," "]
[null,null,null,null," "]
[null,null,null,null," "]
[null,null,null,null," "]
[null,null,null,null," "]
[null,null,null,null," "]
[null,null,null,null," "]
[null,null,null,null," "]
[null,null,null,null," "]
[null,null,null,null," "]
[null,null,null,null," "]
[null,null,null,null," "]
[null,null,null,null," "]
[null,null,null,null," "]
[null,null,null,null," "]
[null,null,null,null," "]
[null,null,null,null," "]
[null,null,null,null," "]
[null,null,null,null," "]
[null,null,null,null," "]
[null,null,null,null," "]
[null,null,null,null," "]
[null,null,null,null," "]
[null,null,null,null," "]
[null,null,null,null," "]
[null,null,null,null," "]
[null,null,null,null," "]
[null,null,null,null,{"$f":"IF(OR(AND(C104<=3,D104=1),AND(C104=1,D104=2),AND(C104=1,D104=3)),\"Risque faible\",IF(OR(AND(C104=4,D104=1),AND(C104=3,D104=2),AND(C104=2,D104=2),AND(C104=2,D104=3),AND(C104=1,D104=4)),\"Risque moyen\",IF(OR(AND(C104=4,D104=2),AND(C104>=3,D104=3),AND(C104>=2,D104=4)),\"Risque élevé\",\" \")))","v":" "}]
[null,null,null,null," "]
[null,null,null,null," "]
[null,null,null,null," "]
[null,null,null,null," "]
[null,null,null,null," "]
[null,null,null,null," "]
[null,null,null,null," "]
[null,null,null,null," "]
[null,null,null,null," "]
[null,null,null,null," "]
[null,null,null,null," "]
[null,null,null,null," "]
[null,null,null,null," "]
[null,null,null,null," "]
[null,null,null,null," "]
[null,null,null,null," "]
[null,null,null,null," "]
[null,null,null,null," "]
[null,null,null,null," "]
[null,null,null,null," "]
[null,null,null,null," "]
[null,null,null,null," "]
[null,null,null,null," "]
[null,null,null,null," "]
[null,null,null,null," "]
[null,null,null,null," "]
[null,null,null,null," "]
[null,null,null,null," "]
[null,null,null,null," "]
[null,null,null,null," "]
[null,null,null,null," "]
[null,null,null,null," "]
[null,null,null,null," "]
[null,null,null,null," "]
[null,null,null,null," "]
[null,null,null,null," "]
[null,null,null,null," "]

{"sheet":"Outils 1","index":14,"n_rows":22,"n_cols":3,"rows_kept":22,"cut":false,"hidden":false,"merged":[[21,2,21,5],[17,0,19,0],[20,0,21,0],[16,1,16,5],[2,0,2,4],[17,2,17,5],[18,2,18,5],[19,2,19,5],[20,2,20,5],[10,0,10,6],[11,0,11,6],[8,0,8,4],[1,0,1,6],[4,0,4,6],[7,0,7,6],[13,0,13,6],[5,0,5,4]]}
[]
["üRapport d'activité médical du rique infectieux"]
["http://www.cpias.fr/nosobase/recommandations/cclin_arlin/EHPAD/V2015/ramri.doc"]
[]
["üSupports de formation"]
["http://www.cpias-ile-de-france.fr/"]
[]
["üFiches techniques EHPAD CCLIN/ARLIN"]
["http://www.cpias.fr/EMS/referentiel/fiches_cpias.html"]
[]
["üSurveillance des IAS tout au long du parcours de santé : Prev EHPAD"]
["http://www.cpias-auvergnerhonealpes.fr/EHPAD/EHPAD_Prevalence.html"]
[]
["üKit BMR EHPAD"]
["http://www.cpias-auvergnerhonealpes.fr/Doc_Reco/guides/2015_BMR_BHRe_EMS_ArlinAuvergne.pdf"]
[]
[null,"Antibiotiques"]
["KIT Antibiotiques","Guide prescription","http://www.omedit-idf.fr/juste-prescriptionbon-usage/infectiologie/bon-usage-des-antibiotiques-en-ehpad/"]
[null,"Affiches Omédit","https://solidarites-sante.gouv.fr/IMG/pdf/depliant-recto_verso-3.pdf"]
[null,"Formation soignants ppt","https://www.youtube.com/playlist?list=PLyBYWsX9QAMH25n73kh2IfT1AEfStLhl7"]
["Sites d'aide à la presciprion","Antibioclic","http://antibioclic.com/"]
[null,"Medqual","http://www.medqual.fr\n"]

{"sheet":"Chapitre II","index":15,"n_rows":327,"n_cols":3,"rows_kept":327,"cut":false,"hidden":false,"merged":[[0,0,0,2],[1,0,1,2]]}
["CHAPITRE II"]
["GESTION DE L'ENVIRONNEMENT ET DES CIRCUITS"]
[]
[]
[]
["Rappel: ","les données sont à saisir dans les cellules vert pâle. Saisie obligatoire pour tous les critères proposés."]
[null,"Pour certaines questions, lorsqu'une réponse négative est donnée, les questions suivantes apparaissent en gris:"]
[null,"vous n'avez pas à y répondre."]
[]
["II-1 Entretien des locaux"]
[]
[]
[null,"Il existe des procédures institutionnelles (protocoles) de nettoyage des locaux dans l'établissement"]
[null,"1=Oui, 2=Non"]
[null,"Si oui, elles sont:"]
[null,"          - validées par le médecin coordonnateur ou le directeur de l'établissement ou par l'instance de prévention des infections"]
[null,"1=Oui, 2=Non"]
[null,"          - diffusées, présentées et mises à disposition dans tous les secteurs de l'EHPAD"]
[null,"1=Oui, 2=Non"]
[null,"          - évaluées"]
[null,"1=Oui, 2=Non"]
[null,"Si oui, elles concernent le nettoyage:"]
[null,"          - quotidien de la chambre"]
[null,"1=Oui, 2=Non"]
[null,"          - trimestriel approfondi de la chambre"]
[null,"1=Oui, 2=Non"]
[null,"          - approfondi de la chambre systématiquement au départ du résident"]
[null,"1=Oui, 2=Non"]
[null,"          - quotidien des sanitaires communs"]
[null,"1=Oui, 2=Non"]
[null,"          - des lieux de vie collectifs (restauration, animation, …) après chaque utilisation"]
[null,"1=Oui, 2=Non"]
[null,"          - du (des) bureau(x) de consultation"]
[null,"1=Oui, 2=Non, 3=NA"]
[null,"          - de la (des) salle(s) de soins"]
[null,"1=Oui, 2=Non"]
[null,"Si oui, elles comportent:"]
[null,"          - une traçabilité de l'entretien des locaux"]
[null,"1=Oui, 2=Non"]
[null,"          - l'utilisation de:"]
[null,"                    ● détergents"]
[null,"1=Oui, 2=Non"]
[null,"                    ● détergents / désinfectants"]
[null,"1=Oui, 2=Non"]
[null,"                    ● la méthode vapeur"]
[null,"1=Oui, 2=Non"]
[null,"          - une liste des produits disponibles"]
[null,"1=Oui, 2=Non"]
[null,"Les moyens alloués permettent l'application des ces procédures de nettoyage des locaux:"]
[null,"          - un chariot de ménage adapté est à la disposition des équipes"]
[null,"1=Oui, 2=Non"]
[null,"          - le matériel nécessaire existe:"]
[null,"                    ● les bandeaux"]
[null,"1=Oui, 2=Non"]
[null,"                    ● les balais trapèzes"]
[null,"1=Oui, 2=Non"]
[null,"                    ● les chiffonnettes"]
[null,"1=Oui, 2=Non"]
[null,"                    ● les produits"]
[null,"1=Oui, 2=Non"]
[]
["II-2 Hygiène en restauration"]
[]
[null,"Le dernier audit réalisé par les services vétérinaires date de moins de 3 ans"]
[null,"1=Oui, 2=Non"]
[null,"La méthode HACCP est en place dans les services cuisines"]
[null,"1=Oui, 2=Non"]
[null,"Type de liaison entre la cuisine et les lieux de restauration"]
[null,"1=Liaison chaude, 2=Liaison froide"]
[null,"En liaison chaude"]
[null,"          - la température à 63°C minimum des aliments chauds servis aux résidents est contrôlée"]
[null,"1=Oui, 2=Non"]
[null,"          - la température à <8°C des aliments froids est contrôlée"]
[null,"1=Oui, 2=Non"]
[]
[null,"En liaison froide"]
[null,"          - la température à 3°C des aliments cuisinés avant remise en température est contrôlée"]
[null,"1=Oui, 2=Non"]
[null,"          - la température <8°C des aliments froids est contrôlée"]
[null,"1=Oui, 2=Non"]
[null,"          - la température à 63°C des aliments cuisinés après remise en tempéature est contrôlée"]
[null,"1=Oui, 2=Non"]
[null,"Des thermomètres sont à disposition du personnel sur les lieux de restauration"]
[null,"1=Oui, 2=Non"]
[null,"La température des réfrigérateurs est contrôlée et enregistrée"]
[null,"1=Oui, 2=Non"]
[null,"En cas de températures non conformes, vous disposez d'une conduite à tenir (protocole)"]
[]
[null,"Votre établissement a instauré un protocole concernant la distribution des repas validé par le médecin coordonnateur ou le directeur de l'établissement ou par l'instance de prévention des infections"]
[null,"1=Oui, 2=Non"]
[null,"Si oui, il prévoit:"]
[null,"          - l'hygiène des mains systématique"]
[null,"                    ● des agents avant la distribution"]
[null,"1=Oui, 2=Non"]
[null,"                    ● des résidents avant le repas"]
[null,"1=Oui, 2=Non"]
[null,"          - la protection de la tenue pour servir les repas"]
[null,"1=Oui, 2=Non"]
[]
[null,"Votre établissement a instauré un protocole validé par le médecin coordonnateur et le directeur concernant l'entretien :"]
[null,"          - des chariots de distribution des repas dans les unités"]
[null,"1=Oui, 2=Non, 3=NA"]
[null,"          - des réfrigirateurs"]
[null,"1=Oui, 2=Non, 3=NA"]
[null,"                    ● si oui, fréquence exprimée en semaine:"]
[]
[]
[null,"          - des micro-ondes"]
[null,"1=Oui, 2=Non, 3=NA"]
[null,"                    ● si oui, fréquence exprimée en semaine:"]
[]
[]
[null,"          - des chauffes lait"]
[null,"1=Oui, 2=Non, 3=NA"]
[null,"                    ● si oui, fréquence exprimée en semaine:"]
[]
[]
[null,"          - des bouilloires"]
[null,"1=Oui, 2=Non, 3=NA"]
[null,"                    ● si oui, fréquence du détartrage exprimée en semaine:"]
[]
[]
[null,"Des CAT sont prévus en cas de dysfonctionnement(s)"]
[null,"1=Oui, 2=Non"]
[null,"Au cours de l'année écoulée votre établissement a rencontré un épisode de toxi-infection alimentaire collective (TIAC)"]
[null,"1=Oui, 2=Non"]
[null,"Votre établissement a défini un protocole concernant le fonctionnement \"d'atelier cuisine\""]
[null,"1=Oui, 2=Non"]
[]
["II-3 Gestion du linge"]
[]
[null,"L'établissement prend en charge la blanchisserie",1]
[null,"1=Totalement, 2=Partiellement, 3=Pas du tout"]
[]
[null,"Circuit du linge propre "]
[]
[null,"Il existe des procédures de gestion du linge propre dans l'établissement y compris le linge du résident",1]
[null,"1=Oui, 2=Non"]
[null,"Si oui, elles sont:"]
[null,"          - validées par le médecin coordonnateur ou le directeur de l'établissement ou par l'instance de prévention des infections",1]
[null,"1=Oui, 2=Non"]
[null,"          - diffusées et mises à disposition dans tous les secteurs de l'EHPAD",1]
[null,"1=Oui, 2=Non"]
[null,"          - évaluées au cours des 3 dernières années",1]
[null,"1=Oui, 2=Non"]
[null,"Le linge propre est maintenu à l'abri d'une contamination:"]
[null,"          - il est filmé"]
[null,"1=Oui, 2=Non"]
[null,"          - il est entreposé dans un chariot, une armoire ou un local fermé"]
[null,"1=Oui, 2=Non"]
[null,"Une hygiène des mains est demandée avant tout manipulation (inclus dans le protocole)"]
[null,"1=Oui, 2=Non"]
[]
[null,"Circuit du linge sale"]
[]
[null,"Il existe des procédures de gestion du linge sale dans l'établissement",1]
[null,"1=Oui, 2=Non"]
[null,"Si oui, elles sont:"]
[null,"          - validées par le médecin coordonnateur ou le directeur de l'établissement ou par l'instance de prévention des infections",1]
[null,"1=Oui, 2=Non"]
[null,"          - diffusées et mises à disposition dans tous les secteurs de l'EHPAD"]
[null,"1=Oui, 2=Non"]
[null,"          - évaluées au cours des 3 dernières années"]
[null,"1=Oui, 2=Non"]
[null,"Si oui, elles portent sur l'existence d'un:"]
[null,"          - tri à la production"]
[null,"1=Oui, 2=Non"]
[null,"          - conditionnement (sacs étanches,…)"]
[null,"1=Oui, 2=Non"]
[null,"          - lieu de stockage intermédiaire"]
[null,"1=Oui, 2=Non"]
[null,"Lors des manipulations du linge souillé de liquides biologiques (selles, urines, sang), il est demandé d'appliquer les précautions \"standard\":"]
[null,"          - le port de gants"]
[null,"1=Oui, 2=Non"]
[null,"          - l'hygiène des mains"]
[null,"1=Oui, 2=Non"]
[null,"          - la protection de la tenue"]
[null,"1=Oui, 2=Non"]
[null,"Les moyens alloués permettent l'application de ces procédures"]
[null,"1=Oui, 2=Non"]
[null,"          - un chariot ou armoire ou local dédié fermé au linge propre est en place"]
[null,"1=Oui, 2=Non"]
[null,"          - des sacs permettant le tri du linge sale / souillé dès la production existent"]
[null,"1=Oui, 2=Non"]
[null,"          - le matériel de protection du personnel est à disposition"]
[null,"1=Oui, 2=Non"]
[]
["II-4 Gestion des déchets"]
[]
[null,"Il existe des procédures institutionnelles de gestion des déchets dans l'établissement"]
[null,"1=Oui, 2=Non"]
[null,"Si oui, elles sont:"]
[null,"          - validées par le médecin coordonnateur ou le directeur de l'établissement ou par l'instance de prévention des infections"]
[null,"1=Oui, 2=Non"]
[null,"          - diffusées et mises à disposition dans tous les secteurs de l'EHPAD"]
[null,"1=Oui, 2=Non"]
[null,"          - évaluées au cours des 3 dernières années"]
[null,"1=Oui, 2=Non"]
[null,"Il existe une personne responsable de la mise en place de la politique du tri des déchets"]
[null,"1=Oui, 2=Non"]
[null,"Si oui, elle gère cette politique qui porte sur:"]
[null,"          - le tri à la production OM, DASRI et OPCT"]
[null,"1=Oui, 2=Non"]
[null,"          - le conditionnement identifié OM, DSARI et OPCT"]
[null,"1=Oui, 2=Non"]
[null,"          - le lieu de stockage conforme aux normes"]
[null,"1=Oui, 2=Non"]
[null,"          - l'évacuation et le transport des DASRI"]
[null,"1=Oui, 2=Non"]
[null,"Vous pouvez indiquer:"]
[null,"          - la production DASRI (kg/mois)"]
[]
[null,"          - le délai de stockage (jours)"]
[]
[null,"Lors de manipulations de tous les  déchets, il est demandé d'appliquer les précautions \"standard\":"]
[null,"          - le port de gants"]
[null,"1=Oui, 2=Non"]
[null,"          - l'hygiène des mains"]
[null,"1=Oui, 2=Non"]
[null,"          - la protection de la tenue"]
[null,"1=Oui, 2=Non"]
[null,"Les moyens alloués permettent l'application de ces procédures et sont à disposition des équipes:"]
[null,"          - les sacs à déchets OM"]
[null,"1=Oui, 2=Non"]
[null,"          - les sacs et/ou cartons à déchets DASRI"]
[null,"1=Oui, 2=Non"]
[null,"          - les collecteurs OPCT répondant à la norme NFX 30500"]
[null,"1=Oui, 2=Non"]
[null,"          - le matériel de protection individuel du personnel"]
[null,"1=Oui, 2=Non"]
[]
["II-5 Gestion de la qualité de l'eau"]
[]
[null,"Eau chaude sanitaire"]
[]
[null,"Au moins, un contrôle annuel visant le dénombrement des légionelles est réalisé dans l'établissement"]
[null,"1=Oui, 2=Non"]
[null,"Le laboratoire sollicité est accrédité"]
[null,"1=Oui, 2=Non"]
[null,"Il comporte au moins cinq points de prélèvement"]
[null,"1=Oui, 2=Non"]
[null,"Si vous avez été confronté à une non-conformité, vérifiez que les points suivants ont été réalisés:"]
[null,"          - sécurisation des points d'usage par la mise en place de filtration terminale sur douche et/ou robinet (si impossible, arrêt de l'utilisation)"]
[null,"1=Oui, 2=Non, 3=NA"]
[null,"          - sensibilisation des médecins au risque de survenue de cas pendant 10 jours après l'arrêt de l'exposition"]
[null,"1=Oui, 2=Non, 3=NA"]
[null,"          - mesures correctives"]
[null,"1=Oui, 2=Non, 3=NA"]
[null,"          - vérification de la normalisation des analyses"]
[null,"1=Oui, 2=Non, 3=NA"]
[]
[null,"Le carnet sanitaire portant sur l'eau est en place"]
[null,"1=Oui, 2=Non"]
[null,"Si oui, il contient les éléments suivants:"]
[null,"          - un audit portant sur le réseau par un organisme spécialisé"]
[null,"1=Oui, 2=Non"]
[null,"          - la cartographie du réseau"]
[null,"1=Oui, 2=Non"]
[null,"          - le suivi des températures"]
[null,"1=Oui, 2=Non"]
[null,"          - la liste des travaux en cours"]
[null,"1=Oui, 2=Non"]
[null,"          - les opérations de maintenance sur le réseau"]
[null,"1=Oui, 2=Non"]
[null,"          - les traitements contre le tartre"]
[null,"1=Oui, 2=Non, 3=NA"]
[null,"          - les traitements de désinfection de la robinetterie"]
[null,"1=Oui, 2=Non, 3=NA"]
[null,"          - les résultats d'analyse"]
[null,"1=Oui, 2=Non"]
[null,"          - la circulaire n°493 du 28 octobre 2005 est à disposition"]
[null,"1=Oui, 2=Non"]
[null,"          - l'arrêté du 1er février 2010 est à disposition"]
[null,"1=Oui, 2=Non"]
[null,"          - traçabilité de la purge des points d'usage eau chaude et froide si inutilisés 1 fois par semaine au minimum"]
[null,"1=Oui, 2=Non"]
[null,"          - le relevé de consommation eau chaude et eau froide (relevé des compteurs)"]
[null,"1=Oui, 2=Non"]
[null,"          - la fiche d'entretien ou de suivi"]
[null,"1=Oui, 2=Non"]
[null,"Devant des dysfonctionnements et/ou en présence de résultats d'analyse non conformes,"]
[null,"     - une procédure détaillant la conduite à tenir dans l'établissement est en place"]
[null,"1=Oui, 2=Non"]
[null,"     - une information vers le médecin coordonnateur est systématique"]
[null,"1=Oui, 2=Non"]
[null,"Vous avez à disposition une conduite à tenir devant une légionellose pulmonaire:"]
[null,"     - pour la prise en charge du résident"]
[null,"1=Oui, 2=Non"]
[null,"     - pour les actions à mener concernant le réseau eau dans l'EHPAD"]
[null,"1=Oui, 2=Non"]
[null,"     - pour la déclaration obligatoire (DO) d'une légionellose d'un résident"]
[null,"1=Oui, 2=Non"]
[]
[null,"Eau de consommation alimentaire"]
[]
[null,"Concernant l'eau du robinet, au moins, un prélèvement annuel contrôlant la potabilité au niveau des points des offices alimentaires est réalisé"]
[null,"1=Oui, 2=Non"]
[null,"Vous utilisez l'eau embouteillée"]
[null,"1=Oui, 2=Non"]
[null,"          - une vérification de la date limite de consommation est réalisée"]
[null,"1=Oui, 2=Non"]
[null,"          - un lieu de stockage adapté est prévu"]
[null,"1=Oui, 2=Non"]
[null,"Vous utilisez l'eau des fontaines réfrigérantes"]
[null,"1=Oui, 2=Non"]
[null,"          - un prélèvement annuel contrôlant la potabilité des fontaines est réalisé"]
[null,"1=Oui, 2=Non"]
[null,"          - un entretien régulier des fontaines est programmé selon les préconisations du fabriquant"]
[null,"1=Oui, 2=Non"]
[null,"          - il existe une maintenance du circuit interne"]
[null,"1=Oui, 2=Non"]
[null,"Vous utilisez l'eau distribuée à partir de bombonne"]
[null,"1=Oui, 2=Non"]
[null,"          - un cahier des charges est en place avec la société distributrice de ce type d'eau"]
[null,"1=Oui, 2=Non"]
[null,"          - une maintenance du système est assurée par cette société"]
[null,"1=Oui, 2=Non"]
[null,"Devant des dysfonctionnements et/ou en présence de résultats d'analyse non conformes de la qualité de l'eau de consommation alimentaire,"]
[null,"     - une procédure détaillant la conduite à tenir dans l'établissement est en place"]
[null,"1=Oui, 2=Non"]
[null,"     - une information vers le médecin coordonnateur est systématique"]
[null,"1=Oui, 2=Non"]
[]
[]
[null,"MENU"]
[]
[null,"CHAPITRE III"]

{"sheet":"Score3","index":16,"n_rows":2,"n_cols":31,"rows_kept":2,"cut":false,"hidden":true,"merged":[]}
["CODETAB","FINESS","MAT1","MAT2","MAT3","MAT4","MAT5","MAT6","MAT7","MAT8","MAT9","MAT10","MAT11","MAT12","MAT13","MAT14","DENOMAT3","DENOMAT4","DENOMAT5","DENOMAT6","DENOMAT7","DENOMAT8","DENOMAT9","DENOMAT10","DENOMAT11","DENOMAT12","DENOMAT13","DENOMAT14","NUM3","DENOM3","SCORE3"]
[{"$f":"CODE","v":0},{"$f":"FINESS","v":0},{"$f":"IF(CHAPIII!C2=1,1,0)","v":0},{"$f":"IF(CHAPIII!D2=1,1,0)","v":0},{"$f":"IF(AND(CHAPIII!G2=1,CHAPIII!H2=1,CHAPIII!I2=1,CHAPIII!J2=1),1,0)","v":0},{"$f":"IF(AND(CHAPIII!K2=1,CHAPIII!L2=1,CHAPIII!M2=1,CHAPIII!N2=1),1,0)","v":0},{"$f":"IF(AND(CHAPIII!O2=1,CHAPIII!P2=1,CHAPIII!Q2=1,CHAPIII!R2=1),1,0)","v":0},{"$f":"IF(AND(CHAPIII!S2=1,CHAPIII!T2=1,CHAPIII!U2=1,CHAPIII!V2=1),1,0)","v":0},{"$f":"IF(AND(CHAPIII!W2=1,CHAPIII!X2=1,CHAPIII!Y2=1,OR(CHAPIII!Z2=1,CHAPIII!AA2=1)),1,0)","v":0},{"$f":"IF(AND(CHAPIII!AB2=1,CHAPIII!AC2=1,CHAPIII!AD2=1,OR(CHAPIII!AE2=1,CHAPIII!AF2=1)),1,0)","v":0},{"$f":"IF(AND(CHAPIII!AG2=1,CHAPIII!AH2=1,CHAPIII!AI2=1,OR(CHAPIII!AJ2=1,CHAPIII!AK2=1)),1,0)","v":0},{"$f":"IF(AND(CHAPIII!AL2=1,CHAPIII!AM2=1,CHAPIII!AN2=1,OR(CHAPIII!AO2=1,CHAPIII!AP2=1)),1,0)","v":0},{"$f":"IF(AND(CHAPIII!AQ2=1,CHAPIII!AR2=1,CHAPIII!AS2=1,OR(CHAPIII!AT2=1,CHAPIII!AU2=1)),1,0)","v":0},{"$f":"IF(AND(CHAPIII!AV2=1,CHAPIII!AW2=1,CHAPIII!AX2=1,OR(CHAPIII!AY2=1,CHAPIII!AZ2=1)),1,0)","v":0},{"$f":"IF(AND(CHAPIII!BA2=1,CHAPIII!BB2=1,CHAPIII!BC2=1,OR(CHAPIII!BD2=1,CHAPIII!BE2=1)),1,0)","v":0},{"$f":"IF(AND(CHAPIII!BF2=1,CHAPIII!BG2=1,CHAPIII!BH2=1,CHAPIII!BI2=1),1,0)","v":0},{"$f":"IF(CHAPIII!G2=2,0,1)","v":1},{"$f":"IF(CHAPIII!K2=2,0,1)","v":1},{"$f":"IF(CHAPIII!O2=2,0,1)","v":1},{"$f":"IF(CHAPIII!S2=2,0,1)","v":1},{"$f":"IF(CHAPIII!W2=2,0,1)","v":1},{"$f":"IF(CHAPIII!AB2=2,0,1)","v":1},{"$f":"IF(CHAPIII!AG2=2,0,1)","v":1},{"$f":"IF(CHAPIII!AL2=2,0,1)","v":1},{"$f":"IF(CHAPIII!AQ2=2,0,1)","v":1},{"$f":"IF(CHAPIII!AV2=2,0,1)","v":1},{"$f":"IF(CHAPIII!BA2=2,0,1)","v":1},{"$f":"IF(CHAPIII!BF2=2,0,1)","v":1},{"$f":"SUM(C2:P2)","v":0},{"$f":"SUM(Q2:AB2,2)","v":14},{"$f":"AC2/AD2*100","v":0}]

{"sheet":"CHAPIII","index":17,"n_rows":2,"n_cols":61,"rows_kept":2,"cut":false,"hidden":true,"merged":[]}
["CODETAB","FINESS","UNIQUE","REUTIL","EQUIPEMENT","DM","EXTRACTEUR","EXTRAPROT","EXTRAVAL","EXTRADETER","GENERATEUR","GENEPROT","GENEVAL","GENEDETER","THERMO","THERMOPROT","THERMOVAL","THERMODETER","BRASSARD","BRASSARDPROT","BRASSARDVAL","BRASSARDETER","LIT","LITPROT","LITVAL","LITDETER","LITVAP","LEVE","LEVEPROT","LEVEVAL","LEVEDETER","LEVEVAP","SOINS","SOINPROT","SOINVAL","SOINDETER","SOINVAP","MEDICA","MEDIPROT","MEDIVAL","MEDIDETER","MEDIVAP","PROPRE","PROPRPROT","PROPRVAL","PROPRDETER","PROPRVAP","SALE","SALEPROT","SALEVAL","SALEDETER","SALEVAP","CHAISE","CHAISEPROT","CHAISEVAL","CHAISEDETER","CHAISEVAP","BASSIN","BASSINPROT","BASSINVAL","BASSINDETER"]
[{"$f":"CODE","v":0},{"$f":"FINESS","v":0},{"$f":"'Chapitre III'!C10","v":0},{"$f":"'Chapitre III'!C12","v":0},{"$f":"'Chapitre III'!B15","v":0},{"$f":"'Chapitre III'!B19","v":0},{"$f":"'Chapitre III'!C23","v":0},{"$f":"'Chapitre III'!C25","v":0},{"$f":"'Chapitre III'!C27","v":0},{"$f":"'Chapitre III'!C29","v":0},{"$f":"'Chapitre III'!C31","v":0},{"$f":"'Chapitre III'!C33","v":0},{"$f":"'Chapitre III'!C35","v":0},{"$f":"'Chapitre III'!C37","v":0},{"$f":"'Chapitre III'!C39","v":0},{"$f":"'Chapitre III'!C41","v":0},{"$f":"'Chapitre III'!C43","v":0},{"$f":"'Chapitre III'!C45","v":0},{"$f":"'Chapitre III'!C47","v":0},{"$f":"'Chapitre III'!C49","v":0},{"$f":"'Chapitre III'!C51","v":0},{"$f":"'Chapitre III'!C53","v":0},{"$f":"'Chapitre III'!C55","v":0},{"$f":"'Chapitre III'!C57","v":0},{"$f":"'Chapitre III'!C59","v":0},{"$f":"'Chapitre III'!C62","v":0},{"$f":"'Chapitre III'!C64","v":0},{"$f":"'Chapitre III'!C66","v":0},{"$f":"'Chapitre III'!C68","v":0},{"$f":"'Chapitre III'!C70","v":0},{"$f":"'Chapitre III'!C73","v":0},{"$f":"'Chapitre III'!C75","v":0},{"$f":"'Chapitre III'!C77","v":0},{"$f":"'Chapitre III'!C79","v":0},{"$f":"'Chapitre III'!C81","v":0},{"$f":"'Chapitre III'!C84","v":0},{"$f":"'Chapitre III'!C86","v":0},{"$f":"'Chapitre III'!C88","v":0},{"$f":"'Chapitre III'!C90","v":0},{"$f":"'Chapitre III'!C92","v":0},{"$f":"'Chapitre III'!C95","v":0},{"$f":"'Chapitre III'!C97","v":0},{"$f":"'Chapitre III'!C99","v":0},{"$f":"'Chapitre III'!C101","v":0},{"$f":"'Chapitre III'!C103","v":0},{"$f":"'Chapitre III'!C106","v":0},{"$f":"'Chapitre III'!C108","v":0},{"$f":"'Chapitre III'!C110","v":0},{"$f":"'Chapitre III'!C112","v":0},{"$f":"'Chapitre III'!C114","v":0},{"$f":"'Chapitre III'!C117","v":0},{"$f":"'Chapitre III'!C119","v":0},{"$f":"'Chapitre III'!C121","v":0},{"$f":"'Chapitre III'!C123","v":0},{"$f":"'Chapitre III'!C125","v":0},{"$f":"'Chapitre III'!C128","v":0},{"$f":"'Chapitre III'!C130","v":0},{"$f":"'Chapitre III'!C132","v":0},{"$f":"'Chapitre III'!C134","v":0},{"$f":"'Chapitre III'!C136","v":0},{"$f":"'Chapitre III'!C138","v":0}]

{"sheet":"Eval 2","index":18,"n_rows":35,"n_cols":17,"rows_kept":35,"cut":false,"hidden":false,"merged":[[18,4,21,4],[0,2,0,3],[2,0,2,1],[18,0,23,0],[24,0,34,0],[13,0,17,0],[9,0,12,0],[3,0,8,0],[18,1,21,1],[18,2,21,2],[18,3,21,3]]}
[null,"Renseigner les cases bleu pâle:",null,null,null,"Renseigner obligatoirement"]
[]
["Gestion de l'environnement et des circuits",null,"Fréquence","Gravité","Risque  ","Actions Proposées en comité de pilotage","Validation",null,"Suivi autoévaluation GREPHH\n(à renseigner obligatoirement)",{"$f":"EHPAD!B7","v":2018},{"$f":"J3+1","v":2019},{"$f":"K3+1","v":2020},2021,2022,2023,2024,2025]
["Entretien des locaux","Non respect des procédures d'entretien des locaux",1,3,{"$f":"IF(OR(AND(C4<=3,D4=1),AND(C4=1,D4=2),AND(C4=1,D4=3)),\"Risque faible\",IF(OR(AND(C4=4,D4=1),AND(C4=3,D4=2),AND(C4=2,D4=2),AND(C4=2,D4=3),AND(C4=1,D4=4)),\"Risque moyen\",IF(OR(AND(C4=4,D4=2),AND(C4=3,D4=3),AND(C4=4,D4=3),AND(C4=2,D4=4),AND(C4=3,D4=4),AND(C4=4,D4=4)),\"Risque élevé\",\" \")))","v":"Risque faible"},"Refaire une information aux agents et améliorer la traçabilité de l'entretien des locaux",null,null,"Entretien des locaux"]
[null,"Prolifération de nuisibles à l'intérieur ou à  l'extérieur de l'établissement (Ex. rats, blattes,,,,)",1,2,{"$f":"IF(OR(AND(C5<=3,D5=1),AND(C5=1,D5=2),AND(C5=1,D5=3)),\"Risque faible\",IF(OR(AND(C5=4,D5=1),AND(C5=3,D5=2),AND(C5=2,D5=2),AND(C5=2,D5=3),AND(C5=1,D5=4)),\"Risque moyen\",IF(OR(AND(C5=4,D5=2),AND(C5=3,D5=3),AND(C5=4,D5=3),AND(C5=2,D5=4),AND(C5=3,D5=4),AND(C5=4,D5=4)),\"Risque élevé\",\" \")))","v":"Risque faible"},"Intégrer dans le livret d'accueil la nécessité de mettre les denrées alimentaires personnelles dans des boites hermétiques",null,null,"hygiène en restauration"]
[null,"Défaut de prévention concernant les nuisibles importés par le mobilier personnel des résidents",1,2,"Risque faible","Organiser un bionettoyage systématique des meubles personnels des résidents admis pour évaluer la présence de nuisible",null,null,"Gestion du linge"]
[null,"Défaut de conformité vis-à-vis de la norme requise pour les détergents désinfectants",1,2,"Risque faible","Choisir un/des détergents désinfectants répondant aux normes: NF EN 13727\" en condition de saleté\", NF EN 13624 \"en condition de saleté\". En période épidémique de GEA, privilégier un détergent désinfectant  répondant à la norme NF EN 14476 sur les norovirus",null,null,"Gestion des déchets"]
[null,"Texte libre locaux 1",1,3,"Risque faible","Texte libre locaux 1",null,null,"Gestion de la qualité de l'eau"]
[null,"Texte libre locaux 2",1,3,"Risque faible","Texte libre locaux 2",null,null,"Global Environnement "]
["Hygiène en restauration","Risque de TIAC",1,3,"Risque faible","Réévaluer les process en restauration"]
[null,"Défaut d'organisation de l'hygiène des mains des résidents avant les repas",1,2,"Risque faible","Prévoir distributeur SHA en salle à manger et systématiser une FHA à chaque résident arrivant.",null,null,"Suivi formation soignants",{"$f":"J3","v":2018},{"$f":"J11+1","v":2019},{"$f":"K11+1","v":2020},2021,2022,2023,2024,2025]
[null,"Texte libre restauration 1",1,3,"Risque faible","Texte libre restauration 1",null,null,"Taux de Personnel hôtelier formé HACCP (restauration)"]
[null,"Texte libre restauration 2",1,3,"Risque faible","Texte libre restauration 2",null,null,"Taux de Personnel hôtelier formé à l'entretien des locaux"]
["Gestion des déchets","Non respect du circuit des déchets lié à un défaut d'organisation/architecture",1,2,"Risque faible","Prévoir un container fermé pour le transport des déchets dans l'ascenseur avec bionettoyage au décours"]
[null,"Difficulté d'évaluation du poids des DASRI",1,1,"Risque faible","Quantifier la production de DASRI et voir le délai de stockage des DASRI en fonction du poids (cf. bordereaux d'incinération, ou peser les DASRI pendant 1 mois)",null,null,"Audits circuits",{"$f":"J11","v":2018},{"$f":"J15+1","v":2019},{"$f":"K15+1","v":2020},2021,2022,2023,2024,2025]
[null,"DASRI stockés dans le poste de soins au-delà de la journée en cours",1,3,"Risque faible","Dans tous les cas, faire un double emballage / Trouver un local autre que le poste de soins pour le stockage des DASRI (autre local identifié sale)",null,null,"Linge"]
[null,"Non compliance des soignants aux règles du circuit des déchets",1,2,"Risque faible","Texte libre déchets 1",null,null,"Déchets"]
[null,"Texte libre déchets 2",1,2,"Risque faible","Texte libre déchets 2"]
["Gestion du linge","Non respect du circuit du linge lié à un défaut d'organisation/architecture",1,2,"Risque faible","Prévoir des chariots de tri du linge "]
[null,null,null,null,null,"En blanchisserie, faire un  affichage zone propre / zone sale avec mise à disposition du matériel: surblouse manche longue UU,  masque, charlotte,  gants et SHA..."]
[null,null,null,null,null,"Faire respecter la marche en avant en blanchisserie, et/ou  la traçabilité de l'entretien quotidien"]
[null,null,null,null,null,"Rappeler aux agents de ne pas défilmer le linge avant l'utilisation / mettre le chariot de nursing à l'abris d'une contamination"]
[null,"Texte libre linge 1",1,2,"Risque faible","Texte libre linge 1"]
[null,"Texte libre linge 2",1,2,"Risque faible","Texte libre linge 2"]
["Gestion de la qualité de l'eau","Carnet sanitaire non structuré",1,3,"Risque faible","Discuter la réalisation d'un  audit du carnet sanitaire (cf.audit CCLIN sud est) avec plan d'action au décours et l'intégrer au carnet sanitaire"]
[null,"Plan d'échantillonnage non conforme",1,3,"Risque faible","faire un plan d'échantillonnage pour les prélèvements annuels, fond de ballon (dernier de la série si plusieurs), retour de boucle, points les plus défavorisés, points représentatifs de l'usage (salon de coiffure)"]
[null,"Contamination du réseau ECS/EF",1,3,"Risque faible","Signaler la contamination à l'ARS pour structurer le plan d'action"]
[null,"Défaut de suivi du carnet sanitaire",1,4,"Risque moyen","Organiser des réunions de vérification des températures et de suivi de la maintenance du carnet sanitaire (EF et ECS, production et distribution)"]
[null,"Défaut d'identification des points peu ou pas utilisés",1,3,"Risque faible","lister les points peu ou pas utilisés pour mise en place de purges bihebdomadaires systématiques et traçées"]
[null,"Défaut de purge des chambres inoccupées en cas d'hospitalisation des résidents",1,3,"Risque faible","Organiser la procédure d'alerte des chambres inoccupées / résidents non douchés pour activation des purges"]
[null,"Défaut de suivi de la maintenance ",1,3,"Risque faible","Revoir la gamme de maintenance et  sa traçabilité avec le prestataire en charge / agent du service technique (cf. guide legionelle EHPAD 2014)"]
[null,"Défaut de formation du personnel en charge du suivi du carnet sanitaire",1,3,"Risque faible","Programmer une formation au suivi de la maintenance des réseaux d'eau et du carnet sanitaire"]
[null,"Texte libre eau 2",1,3,"Risque faible","Texte libre eau 2"]
[null,"Texte libre eau 3",1,3,"Risque faible","Texte libre eau 3"]
[null,"Texte libre eau 4",1,3,"Risque faible","Texte libre eau 4"]

{"sheet":"Outils 2","index":19,"n_rows":34,"n_cols":15,"rows_kept":34,"cut":false,"hidden":false,"merged":[[2,2,3,2],[4,3,4,14],[5,10,5,14],[6,3,6,14],[7,3,7,14],[17,1,21,1],[18,3,18,14],[20,2,21,2],[19,3,19,14],[8,3,8,14],[9,2,9,14],[10,3,10,14],[11,3,11,14],[13,1,15,1],[13,3,13,6],[13,7,13,14],[15,3,15,14],[0,1,11,1],[0,2,0,14],[1,3,1,7],[1,8,1,14],[28,2,30,2],[24,1,33,1],[24,12,24,14],[26,8,26,11],[26,12,26,14],[31,2,33,2],[31,3,31,14],[32,3,32,14],[27,8,27,11],[27,12,27,14],[25,12,25,14],[29,3,29,14],[24,2,26,2],[28,3,28,14],[33,3,33,14],[30,3,30,14]]}
[null,"GESTION DES DECHETS","Déchets de soins à risques infectieux"]
[null,null,"Personne responsable des déchets","Nom:",null,null,null,null,"Téléphone:"]
[null,null,"Poids (kg) mois","Jan","Fev","Mars","Avril","Mai","Juin","Juillet","Août","Sept","Oct","Nov","Dec"]
[]
[null,null,"N passage/ semaine"]
[null,null,"prestataire   DASRI","Nom: ",null,null,null,"Tél",null,null,"Lieux d'incinération:"]
[null,null,"Coût du tonnage","Diviser le prix total par le poids   -Cf la convention"]
[null,null,"Texte réglementaire","Arrêté du 20 mai 2014 relatif au contrôle des filières d'éliminations et aux modalités d'entreposage des déchets d'activités de soins à risques infectieux et assimilé et des pièces anatomiques\n"]
[null,null,"Lien","https://www.legifrance.gouv.fr/affichTexte.do?cidTexte=JORFTEXT000029190594&categorieLien=id"]
[null,null,"Déchets de soins Assimilés aux Ordures Ménagères"]
[null,null,"Prestataire DAOM"]
[null,null,"N passage /semaine"]
[]
[null,"Restauration","prestataire ",null,null,null,null,"Nom du chef de cuisine: "]
[null,null,"Taux de TIAC ",2019,null,null,2020,null,null,2021,null,null,2022]
[null,null,"Réglementation","Arrêté du 29 septembre 1997 fixant les conditions d'hygiène applicables dans les établissements de restauration collective à caractère social "]
[]
[null,"Gestion du linge","Prestataire  linge","Nom: ",null,null,null,null,"Téléphone:"]
[null,null,"Personne responsable du linge"]
[null,null,"Audit gestion du linge","http://www.cpias-auvergnerhonealpes.fr/Evaluation/Audits/Linge/modele.html"]
[null,null,"Recommandations","Guide pour la mise en œuvre de la méthode RABC en blanchisserie hospitalière"]
[null,null,null,"Guide de la fonction linge dans les maisons de retraite et les centres d'hebergement de longs et moyens séjours"]
[]
[]
[null,"Gestion de la qualité de l'eau","Presonnes en charge du suivi du carnet sanitaire","Nom:",null,null,null,null,"Téléphone:",null,null,null,"Fax/Mail"]
[null,null,null,"Nom:",null,null,null,null,"Téléphone:",null,null,null,"Fax/Mail"]
[null,null,null,"Nom:",null,null,null,null,"Téléphone:",null,null,null,"Fax/Mail"]
[null,null,"Prestataire de maintenance de la chaufferie","Nom:",null,null,null,null,"Téléphone:",null,null,null,"Fax/Mail"]
[null,null,"Gestion du risque lié aux légionelles","https://lesagoras.paca.ars.sante.fr/mediatheque/media/exemple-de-carnet-sanitaire-type-ehpad\n"]
[null,null,null,"Carnet sanitaire_auvergne-rhone-alpes.ars"]
[null,null,null,"https://www.auvergne-rhone-alpes.ars.sante.fr/legionelles-et-legionellose"]
[null,null,"Réglementation ","Arrêté du 1er Février 2010 relatif à la surveillance des légionelles dans les installations de production, de stockage et de distribution d'eau chaude sanitaire"]
[null,null,null,"Circulaire n°493 du 28 octobre 2005"]
[null,null,null,"Guide technique Eau et santé. Ministère de la santé et des solidarités."]

{"sheet":"Chapitre III","index":20,"n_rows":144,"n_cols":2,"rows_kept":144,"cut":false,"hidden":false,"merged":[[0,0,0,2],[1,0,1,2]]}
["CHAPITRE III"]
["GESTION DU MATERIEL DE SOINS"]
[]
[]
[]
["Rappel: ","les données sont à saisir dans les cellules vert pâle. Saisie obligatoire pour tous les critères proposés."]
[null,"Pour certaines questions, lorsqu'une réponse négative est donnée, les questions suivantes apparaissent en gris:"]
[null,"vous n'avez pas à y répondre."]
[]
[null,"La politique de l'établissement privilégie l'usage de dispositifs médicaux à usage unique"]
[null,"1=Oui, 2=Non"]
[null,"Il existe une procédure de traitement (nettoyage-désinfection) du matériel de soins réutilisable ne nécessitant pas de stérilisation"]
[null,"1=Oui, 2=Non"]
[null,"Indiquer les équipements techniques mis à disposition pour stériliser les DM:"]
[]
[]
[]
[null,"Indiquer les DM stérilisés:"]
[]
[]
[null,"Matériels utilisés dans l'établissement"]
[]
[null,"Extracteur à oxygène"]
[null,"1=Oui, 2=Non"]
[null,"          Un protocole existe"]
[null,"1=Oui, 2=Non"]
[null,"          Le protocole est validé"]
[null,"1=Oui, 2=Non"]
[null,"          Type de traitement: Détergent / Désinfectant"]
[null,"1=Oui, 2=Non"]
[null,"Générateur (appareil) aérosol"]
[null,"1=Oui, 2=Non"]
[null,"          Un protocole existe"]
[null,"1=Oui, 2=Non"]
[null,"          Le protocole est validé"]
[null,"1=Oui, 2=Non"]
[null,"          Type de traitement: Détergent / Désinfectant"]
[null,"1=Oui, 2=Non"]
[null,"Thermomètre température résident"]
[null,"1=Oui, 2=Non"]
[null,"          Un protocole existe"]
[null,"1=Oui, 2=Non"]
[null,"          Le protocole est validé"]
[null,"1=Oui, 2=Non"]
[null,"          Type de traitement: Détergent / Désinfectant"]
[null,"1=Oui, 2=Non"]
[null,"Brassard à tension"]
[null,"1=Oui, 2=Non"]
[null,"          Un protocole existe"]
[null,"1=Oui, 2=Non"]
[null,"          Le protocole est validé"]
[null,"1=Oui, 2=Non"]
[null,"          Type de traitement: Détergent / Désinfectant"]
[null,"1=Oui, 2=Non"]
[null,"Chariot lit / douche / fauteuil"]
[null,"1=Oui, 2=Non"]
[null,"          Un protocole existe"]
[null,"1=Oui, 2=Non"]
[null,"          Le protocole est validé"]
[null,"1=Oui, 2=Non"]
[null,"          Type de traitement: "]
[null,"               ● Détergent / Désinfectant"]
[null,"1=Oui, 2=Non"]
[null,"               ● Vapeur"]
[null,"1=Oui, 2=Non"]
[null,"Lève malade (sangles ou hamac)"]
[null,"1=Oui, 2=Non"]
[null,"          Un protocole existe"]
[null,"1=Oui, 2=Non"]
[null,"          Le protocole est validé"]
[null,"1=Oui, 2=Non"]
[null,"          Type de traitement: "]
[null,"               ● Détergent / Désinfectant"]
[null,"1=Oui, 2=Non"]
[null,"               ● Vapeur"]
[null,"1=Oui, 2=Non"]
[null,"Chariot de soins"]
[null,"1=Oui, 2=Non"]
[null,"          Un protocole existe"]
[null,"1=Oui, 2=Non"]
[null,"          Le protocole est validé"]
[null,"1=Oui, 2=Non"]
[null,"          Type de traitement: "]
[null,"               ● Détergent / Désinfectant"]
[null,"1=Oui, 2=Non"]
[null,"               ● Vapeur"]
[null,"1=Oui, 2=Non"]
[null,"Chariot distribution médicaments"]
[null,"1=Oui, 2=Non"]
[null,"          Un protocole existe"]
[null,"1=Oui, 2=Non"]
[null,"          Le protocole est validé"]
[null,"1=Oui, 2=Non"]
[null,"          Type de traitement: "]
[null,"               ● Détergent / Désinfectant"]
[null,"1=Oui, 2=Non"]
[null,"               ● Vapeur"]
[null,"1=Oui, 2=Non"]
[null,"Chariot linge propre"]
[null,"1=Oui, 2=Non"]
[null,"          Un protocole existe"]
[null,"1=Oui, 2=Non"]
[null,"          Le protocole est validé"]
[null,"1=Oui, 2=Non"]
[null,"          Type de traitement: "]
[null,"               ● Détergent / Désinfectant"]
[null,"1=Oui, 2=Non"]
[null,"               ● Vapeur"]
[null,"1=Oui, 2=Non"]
[null,"Chariot linge sale"]
[null,"1=Oui, 2=Non"]
[null,"          Un protocole existe"]
[null,"1=Oui, 2=Non"]
[null,"          Le protocole est validé"]
[null,"1=Oui, 2=Non"]
[null,"          Type de traitement: "]
[null,"               ● Détergent / Désinfectant"]
[null,"1=Oui, 2=Non"]
[null,"               ● Vapeur"]
[null,"1=Oui, 2=Non"]
[null,"Chaise de pesée, plateforme"]
[null,"1=Oui, 2=Non"]
[null,"          Un protocole existe"]
[null,"1=Oui, 2=Non"]
[null,"          Le protocole est validé"]
[null,"1=Oui, 2=Non"]
[null,"          Type de traitement: "]
[null,"               ● Détergent / Désinfectant "]
[null,"1=Oui, 2=Non"]
[null,"               ● Vapeur"]
[null,"1=Oui, 2=Non"]
[null,"Bassin et urinoir"]
[null,"1=Oui, 2=Non"]
[null,"          Un protocole existe"]
[null,"1=Oui, 2=Non"]
[null,"          Le protocole est validé"]
[null,"1=Oui, 2=Non"]
[null,"          Type de traitement: Détergent / Désinfectant"]
[null,"1=Oui, 2=Non"]
[]
[]
[null,"MENU"]
[]
[null,"CHAPITRE IV"]

{"sheet":"Score4","index":21,"n_rows":2,"n_cols":57,"rows_kept":2,"cut":false,"hidden":true,"merged":[]}
["CODETAB","FINESS","ACTE1","ACTE2","ACTE3","ACTE4","ACTE5","ACTE6","ACTE7","ACTE8","ACTE9","ACTE10","ACTE11","ACTE","DENOMACT2","DENOMACT6","DENOMACT7","DENOMACT11","DENOMACT","ANTI1","ANTI2","ANTI3","ANTI4","ANTI5","ANTI6","ANTI7","ANTI8","ANTI","DENOMANTI","STAND1","STAND2","STAND3","STAND4","STAND5","STAND6","STAND7","STAND8","STAND","DENOMSTAND","COMP1","COMP2","COMP3","COMP","DENOMCOMP","HYG1","HYG2","HYG3","HYG","DENOMHYG","SCORE4A","SCORE4B","SCORE4C","SCORE4D","SCORE4E","NUM4","DENOM4","SCORE4"]
[{"$f":"CODE","v":0},{"$f":"FINESS","v":0},{"$f":"IF(AND('CHAP IV'!C2=1,'CHAP IV'!D2=1),1,0)","v":0},{"$f":"IF(AND('CHAP IV'!G2=1,'CHAP IV'!H2=1),1,0)","v":0},{"$f":"IF(AND('CHAP IV'!I2=1,'CHAP IV'!J2=1),1,0)","v":0},{"$f":"IF(AND('CHAP IV'!M2=1,'CHAP IV'!N2=1),1,0)","v":0},{"$f":"IF(AND('CHAP IV'!O2=1,'CHAP IV'!P2=1),1,0)","v":0},{"$f":"IF(AND('CHAP IV'!Q2=1,'CHAP IV'!R2=1),1,0)","v":0},{"$f":"IF(AND('CHAP IV'!S2=1,'CHAP IV'!T2=1),1,0)","v":0},{"$f":"IF(AND('CHAP IV'!U2=1,'CHAP IV'!V2=1),1,0)","v":0},{"$f":"IF(AND('CHAP IV'!W2=1,'CHAP IV'!X2=1),1,0)","v":0},{"$f":"IF(AND('CHAP IV'!AA2=1,'CHAP IV'!AB2=1),1,0)","v":0},{"$f":"IF(AND('CHAP IV'!AC2=1,'CHAP IV'!AD2=1),1,0)","v":0},{"$f":"SUM(C2:M2)","v":0},{"$f":"IF('CHAP IV'!G2=3,0,1)","v":1},{"$f":"IF('CHAP IV'!Q2=3,0,1)","v":1},{"$f":"IF('CHAP IV'!S2=3,0,1)","v":1},{"$f":"IF('CHAP IV'!AC2=3,0,1)","v":1},{"$f":"SUM(O2:R2,7)","v":11},{"$f":"IF('CHAP IV'!AG2=1,1,0)","v":0},{"$f":"IF(AND('CHAP IV'!AH2=1,'CHAP IV'!AI2=1),1,0)","v":0},{"$f":"IF('CHAP IV'!AJ2=1,1,0)","v":0},{"$f":"IF('CHAP IV'!AK2=1,1,0)","v":0},{"$f":"IF('CHAP IV'!AL2=1,1,0)","v":0},{"$f":"IF('CHAP IV'!AM2=1,1,0)","v":0},{"$f":"IF('CHAP IV'!AN2=1,1,0)","v":0},{"$f":"IF('CHAP IV'!AO2=1,1,0)","v":0},{"$f":"SUM(T2:AA2)","v":0},8,{"$f":"IF('CHAP IV'!AP2=1,1,0)","v":0},{"$f":"IF('CHAP IV'!AQ2=1,1,0)","v":0},{"$f":"IF('CHAP IV'!AR2=1,1,0)","v":0},{"$f":"IF('CHAP IV'!AS2=1,1,0)","v":0},{"$f":"IF(AND('CHAP IV'!AT2=1,'CHAP IV'!AU2=1,'CHAP IV'!AV2=1),1,0)","v":0},{"$f":"IF('CHAP IV'!AW2=1,1,0)","v":0},{"$f":"IF('CHAP IV'!AX2=1,1,0)","v":0},{"$f":"IF('CHAP IV'!AY2=1,1,0)","v":0},{"$f":"SUM(AD2:AK2)","v":0},8,{"$f":"IF('CHAP IV'!AZ2=1,1,0)","v":0},{"$f":"IF(AND('CHAP IV'!BA2=1,'CHAP IV'!BB2=1,'CHAP IV'!BC2=1),1,0)","v":0},{"$f":"IF('CHAP IV'!BD2=1,1,0)","v":0},{"$f":"SUM(AN2:AP2)","v":0},3,{"$f":"IF('CHAP IV'!BE2=1,1,0)","v":0},{"$f":"IF('CHAP IV'!BF2=1,1,0)","v":0},{"$f":"IF('CHAP IV'!BG2=1,1,0)","v":0},{"$f":"SUM(AS2:AU2)","v":0},3,{"$f":"N2/S2*100","v":0},{"$f":"AB2/AC2*100","v":0},{"$f":"AL2/AM2*100","v":0},{"$f":"AQ2/AR2*100","v":0},{"$f":"AV2/AW2*100","v":0},{"$f":"N2+AB2+AL2+AQ2+AV2","v":0},{"$f":"S2+AC2+AM2+AR2+AW2","v":33},{"$f":"BC2/BD2*100","v":0}]

{"sheet":"CHAP IV","index":22,"n_rows":2,"n_cols":59,"rows_kept":2,"cut":false,"hidden":true,"merged":[]}
["CODETAB","FINESS","AEROPROTO","AEROVAL","ALIMPROTO","ALIMVAL","ASPIPROTO","ASPIVAL","MAINPROTO","MAINVAL","INJECTPROTO","INJECTVAL","OXYPROTO","OXYVAL","PLAIEPROTO","PLAIEVAL","PERFPROTO","PERFVAL","VOIEPROTO","VOIEVAL","COMPLPROTO","COMPLVAL","STANPROTO","STANVAL","PRELEVPROTO","PRELEVAL","NURSPROTO","NURSVAL","SONDPROTO","SONDVAL","STOMIPROTO","STOMIVAL","ANTISEPT","ANTISEPTVAL","ANTISEPTDIF","CONTACT","DATE","CHOIX","PRESCRIP","ALCOOL","TEMPS","STANDARD","POL","PHA","INFOPHA","ESSUIE","SAVON","POUBELLE","GANTS","POUDRE","PRINCIPE","COMPLEM","CONTAC","GOUTTE","AIR","SIGNAL","TOILETTE","BUCCO","LAVAGE"]
[{"$f":"CODE","v":0},{"$f":"FINESS","v":0},{"$f":"'Chapitre IV'!C15","v":0},{"$f":"'Chapitre IV'!C17","v":0},{"$f":"'Chapitre IV'!C21","v":0},{"$f":"'Chapitre IV'!C23","v":0},{"$f":"'Chapitre IV'!C27","v":0},{"$f":"'Chapitre IV'!C29","v":0},{"$f":"'Chapitre IV'!C33","v":0},{"$f":"'Chapitre IV'!C35","v":0},{"$f":"'Chapitre IV'!C39","v":0},{"$f":"'Chapitre IV'!C41","v":0},{"$f":"'Chapitre IV'!C45","v":0},{"$f":"'Chapitre IV'!C47","v":0},{"$f":"'Chapitre IV'!C51","v":0},{"$f":"'Chapitre IV'!C53","v":0},{"$f":"'Chapitre IV'!C57","v":0},{"$f":"'Chapitre IV'!C59","v":0},{"$f":"'Chapitre IV'!C63","v":0},{"$f":"'Chapitre IV'!C65","v":0},{"$f":"'Chapitre IV'!C69","v":0},{"$f":"'Chapitre IV'!C71","v":0},{"$f":"'Chapitre IV'!C75","v":0},{"$f":"'Chapitre IV'!C77","v":0},{"$f":"'Chapitre IV'!C81","v":0},{"$f":"'Chapitre IV'!C83","v":0},{"$f":"'Chapitre IV'!C87","v":0},{"$f":"'Chapitre IV'!C89","v":0},{"$f":"'Chapitre IV'!C93","v":0},{"$f":"'Chapitre IV'!C95","v":0},{"$f":"'Chapitre IV'!C99","v":0},{"$f":"'Chapitre IV'!C101","v":0},{"$f":"'Chapitre IV'!C106","v":0},{"$f":"'Chapitre IV'!C109","v":0},{"$f":"'Chapitre IV'!C111","v":0},{"$f":"'Chapitre IV'!C113","v":0},{"$f":"'Chapitre IV'!C115","v":0},{"$f":"'Chapitre IV'!C117","v":0},{"$f":"'Chapitre IV'!C119","v":0},{"$f":"'Chapitre IV'!C121","v":0},{"$f":"'Chapitre IV'!C123","v":0},{"$f":"'Chapitre IV'!C128","v":0},{"$f":"'Chapitre IV'!C133","v":0},{"$f":"'Chapitre IV'!C135","v":0},{"$f":"'Chapitre IV'!C137","v":0},{"$f":"'Chapitre IV'!C140","v":0},{"$f":"'Chapitre IV'!C142","v":0},{"$f":"'Chapitre IV'!C144","v":0},{"$f":"'Chapitre IV'!C149","v":0},{"$f":"'Chapitre IV'!C151","v":0},{"$f":"'Chapitre IV'!C153","v":0},{"$f":"'Chapitre IV'!C158","v":0},{"$f":"'Chapitre IV'!C162","v":0},{"$f":"'Chapitre IV'!C164","v":0},{"$f":"'Chapitre IV'!C166","v":0},{"$f":"'Chapitre IV'!C168","v":0},{"$f":"'Chapitre IV'!C173","v":0},{"$f":"'Chapitre IV'!C175","v":0},{"$f":"'Chapitre IV'!C177","v":0}]

{"sheet":"Eval 3","index":23,"n_rows":8,"n_cols":17,"rows_kept":8,"cut":false,"hidden":false,"merged":[[2,0,2,1],[3,0,7,0],[9,0,9,1],[0,2,0,3]]}
[null,"Renseigner les cases bleu pâle:",null,null,null,"Renseigner obligatoirement "]
[]
["Gestion du matériel de soins",null,"Fréquence","Gravité","Risque  ","Actions Proposées en comité de pilotage","Validation",null,"Suivi autoévaluation GREPHH\n(à renseigner obligatoirement)",{"$f":"EHPAD!B7","v":2018},{"$f":"J3+1","v":2019},{"$f":"K3+1","v":2020},2021,2022,2023,2024,2025]
["Gestion du matériel de soins","Défaut d'entretien des sangles du lève malade (tissus…) ",1,2,{"$f":"IF(OR(AND(C4<=3,D4=1),AND(C4=1,D4=2),AND(C4=1,D4=3)),\"Risque faible\",IF(OR(AND(C4=4,D4=1),AND(C4=3,D4=2),AND(C4=2,D4=2),AND(C4=2,D4=3),AND(C4=1,D4=4)),\"Risque moyen\",IF(OR(AND(C4=4,D4=2),AND(C4=3,D4=3),AND(C4=4,D4=3),AND(C4=2,D4=4),AND(C4=3,D4=4),AND(C4=4,D4=4)),\"Risque élevé\",\" \")))","v":"Risque faible"},"Optimiser la fréquence d'entretien des sangles lève malade",null,null,"Gestion du matériel de soins"]
[null,"Défaut d'application des bonnes pratiques en matière de gestion des excrétas (entretien bassin, urinaux ainsi que les seaux des chaises percées)",1,3,{"$f":"IF(OR(AND(C5<=3,D5=1),AND(C5=1,D5=2),AND(C5=1,D5=3)),\"Risque faible\",IF(OR(AND(C5=4,D5=1),AND(C5=3,D5=2),AND(C5=2,D5=2),AND(C5=2,D5=3),AND(C5=1,D5=4)),\"Risque moyen\",IF(OR(AND(C5=4,D5=2),AND(C5=3,D5=3),AND(C5=4,D5=3),AND(C5=2,D5=4),AND(C5=3,D5=4),AND(C5=4,D5=4)),\"Risque élevé\",\" \")))","v":"Risque faible"},"Organiser le circuit des excréta dans un local vidoir avec marche en avant, (transport avec couvercles).\ncf outil du GREPHH \"bonne gestion des excréta\"\nEn cas d'impossibilité de mise en place d'un local vidoir:\nUtiliser les sacs protecteurs de bassin. cf. nosobase fiche technique CPias\nDans tous les cas individualiser le matériel au résident."]
[null,"Défaut d'entretien du matériel",1,2,"Risque faible","Réinformer le personnel sur la gestion du matériel de soin et les précautions standard",null,null,null,{"$f":"J3","v":2018},{"$f":"J6+1","v":2019},{"$f":"K6+1","v":2020},2021,2022,2023,2024,2025]
[null,"Texte libre gestion du matériel de soins 1",1,1,"Risque faible","Texte libre gestion du matériel de soins 1",null,null,"Audit excellence excréta"]
[null,"Texte libre gestion du matériel de soins 2",1,1,"Risque faible","Texte libre gestion du matériel de soins 2"]

{"sheet":"Outils 3","index":24,"n_rows":32,"n_cols":5,"rows_kept":32,"cut":false,"hidden":false,"merged":[[18,0,19,0],[31,4,31,6],[24,4,24,11],[25,4,25,7]]}
[]
[]
[]
["Liste de matériel de soins utilisés ","Quantité","FREQUENCE","IMMERGEABLE fiches techniques 1 et 2","NON IMMERGEABLE essuyage avec DD"]
["Extracteur à oxygène",null,"quotidien + terminal",null,"X"]
["Générateur (appareil) aérosol",null,"quotidien + terminal",null,"X"]
["Thermomètre température du résident",null,"après utilisation",null,"X"]
["Thermomètre tympanique",null,"après utilisation",null,"X"]
["Brassard à tension",null,"hebdomadaire",null,"X"]
["Chariot/Douche",null,"après utilisation",null,"X"]
["Fauteuil/douche",null,"après utilisation",null,"X"]
["Lève malade",null,"hebdomadaire poignées après utilisation",null,"X"]
["Lève malade / sangles",null,"hebdomadaire","lavage en machine"]
["Chariots de soins",null,"après utilisation",null,"X"]
["Chariot de distribution médicaments",null,"quotidien",null,"X"]
["Chariot linge propre",null,"quotidien",null,"X"]
["Chariot linge sale",null,"pluriquotidien",null,"X"]
["Chaise de pesée, plateforme",null,null,null,"X"]
["Bassins et urinoirs, seaux de chaise percée",null,"après utilisation",null,"X, après retrait du dispositif de protection"]
[null,null,"trimestriel","X"]
["Chaises percées",null,"après utilisation",null,"X"]
[]
[]
[]
[null,null,null,null,"Lien: FT n°7 Gestion des excreta \ndans les établissements de santé\n et médico-sociaux "]
[null,null,null,null,"http://www.cpias-ile-de-france.fr/docprocom/doc/FT_Excreta_2010.pdf"]
[]
[null,null,null,null,"Lien REPIAS"]
[null,null,null,null,"https://www.preventioninfection.fr/boites-a-outils/peril-fecal/"]
[]
[null,null,null,null,"Outils_ Audit GEX_ Affiches humoristiques"]
[null,null,null,null,"http://www.cpias-auvergnerhonealpes.fr/excreta/excreta.html"]

{"sheet":"Chapitre IV","index":25,"n_rows":183,"n_cols":3,"rows_kept":183,"cut":false,"hidden":false,"merged":[[0,0,0,2],[1,0,1,2]]}
["CHAPITRE IV"]
["GESTION DES SOINS"]
[]
[]
[]
["Rappel: ","les données sont à saisir dans les cellules vert pâle. Saisie obligatoire pour tous les critères proposés."]
[null,"Pour certaines questions, lorsqu'une réponse négative est donnée, les questions suivantes apparaissent en gris:"]
[null,"vous n'avez pas à y répondre."]
[]
["IV-1 ACTES INFIRMIERS ET DE NURSING"]
[null,null,"Répondre NA (Non Adapté) si les actes ne sont pas réalisés dans l'établissement"]
[null,"Thème des protocoles"]
[null,"Aérosol thérapie"]
[]
[null,"Il existe un protocole "]
[null,"1=Oui, 2=Non"]
[null,"Le protocole est validé"]
[null,"1=Oui, 2=Non"]
[null,"Alimentation entérale"]
[]
[null,"Il existe un protocole "]
[null,"1=Oui, 2=Non, 3=NA"]
[null,"Le protocole est validé"]
[null,"1=Oui, 2=Non"]
[null,"Aspiration buccale ou bronchique"]
[]
[null,"Il existe un protocole "]
[null,"1=Oui, 2=Non, 3=NA"]
[null,"Le protocole est validé"]
[null,"1=Oui, 2=Non"]
[null,"Hygiène des mains et port de gants"]
[]
[null,"Il existe un protocole "]
[null,"1=Oui, 2=Non"]
[null,"Le protocole est validé"]
[null,"1=Oui, 2=Non"]
[null,"Injections (IM/SC/IV)"]
[]
[null,"Il existe un protocole "]
[null,"1=Oui, 2=Non"]
[null,"Le protocole est validé"]
[null,"1=Oui, 2=Non"]
[null,"Oxygénothérapie"]
[]
[null,"Il existe un protocole "]
[null,"1=Oui, 2=Non"]
[null,"Le protocole est validé"]
[null,"1=Oui, 2=Non"]
[null,"Plaies (escarres, ulcères…)"]
[]
[null,"Il existe un protocole "]
[null,"1=Oui, 2=Non"]
[null,"Le protocole est validé"]
[null,"1=Oui, 2=Non"]
[null,"Pose d'une perfusion sous cutanée"]
[]
[null,"Il existe un protocole "]
[null,"1=Oui, 2=Non, 3=NA"]
[null,"Le protocole est validé"]
[null,"1=Oui, 2=Non"]
[null,"Pose d'une voie veineuse"]
[]
[null,"Il existe un protocole "]
[null,"1=Oui, 2=Non, 3=NA"]
[null,"Le protocole est validé"]
[null,"1=Oui, 2=Non"]
[null,"Précautions complémentaires"]
[]
[null,"Il existe un protocole "]
[null,"1=Oui, 2=Non"]
[null,"Le protocole est validé"]
[null,"1=Oui, 2=Non"]
[null,"Précautions standard"]
[]
[null,"Il existe un protocole "]
[null,"1=Oui, 2=Non"]
[null,"Le protocole est validé"]
[null,"1=Oui, 2=Non"]
[null,"Prélèvement veineux"]
[]
[null,"Il existe un protocole "]
[null,"1=Oui, 2=Non, 3=NA"]
[null,"Le protocole est validé"]
[null,"1=Oui, 2=Non"]
[null,"Soins de nursing (toilette, soins bucco-dentaires…)"]
[]
[null,"Il existe un protocole "]
[null,"1=Oui, 2=Non"]
[null,"Le protocole est validé"]
[null,"1=Oui, 2=Non"]
[null,"Sondage vésical"]
[]
[null,"Il existe un protocole "]
[null,"1=Oui, 2=Non, 3=NA"]
[null,"Le protocole est validé"]
[null,"1=Oui, 2=Non"]
[null,"Stomies"]
[]
[null,"Il existe un protocole "]
[null,"1=Oui, 2=Non, 3=NA"]
[null,"Le protocole est validé"]
[null,"1=Oui, 2=Non"]
[]
["IV-2 ANTISEPTIQUES"]
[]
[null,"Il existe un protocole sur l'utilisation des antiseptiques dans l'établissement"]
[null,"1=Oui, 2=Non"]
[null,"S oui, il est:"]
[null,"          - validé par le médecin coordonnateur ou le directeur de l'établissement ou par l'instance de prévention des infections"]
[null,"1=Oui, 2=Non"]
[null,"          - diffusé dans tous les secteurs de l'EHPAD"]
[null,"1=Oui, 2=Non"]
[null,"Le temps de contact des antiseptiques est précisé"]
[null,"1=Oui, 2=Non"]
[null,"L'inscription sur les flacons de la date d'ouverture est demandée"]
[null,"1=Oui, 2=Non"]
[null,"Un choix consensuel de 2 gammes d'antiseptiques a été effectué par le médecin coordonnateur et le pharmacien référent"]
[null,"1=Oui, 2=Non"]
[null,"L'utilisation des antiseptiques fait l'objet d'une prescription médicale"]
[null,"1=Oui, 2=Non"]
[null,"L'utilisation des antiseptiques alcooliques est valorisée"]
[null,"1=Oui, 2=Non"]
[null,"Le principe d'une antisepsie en 4 temps (nettoyage, rinçage, séchage, antisepsie avec séchage spontané) est préconisé (exemple: pose d'un cathéter veineux périphérique ou voie veineuse sous cutanée)"]
[null,"1=Oui, 2=Non"]
[]
["IV-3 PRECAUTIONS STANDARD"]
[]
[null,"Les précautions standard ont fait l'objet d'une information et/ou formation et d'une diffusion large auprès de tout le personnel"]
[null,"1=Oui, 2=Non"]
[]
[null,"Hygiène des mains"]
[]
[null,"La politique de l'hygiène des mains valorise l'utilisation des produits hydro-alcooliques"]
[null,"1=Oui, 2=Non"]
[null,"Des produits hydro-alcooliques sont mis à disposition du personnel"]
[null,"1=Oui, 2=Non"]
[null,"Une information et/ou formation préalable sur les conditions d'utilisation des produits hydro-alcooliques a été effectuée auprès des personnels utilisateurs"]
[null,"1=Oui, 2=Non"]
[null,"Les postes de lavage des mains implantés dans l'établissement comportent:"]
[null,"          - distributeur d'essuie-mains"]
[null,"1=Oui, 2=Non"]
[null,"          - distributeur de savon doux liquide"]
[null,"1=Oui, 2=Non"]
[null,"          - poubelle (commande non manuelle)"]
[null,"1=Oui, 2=Non"]
[]
[null,"Gants"]
[]
[null,"Les gants à usage unique non stériles sont mis à disposition des équipes"]
[null,"1=Oui, 2=Non"]
[null,"L'établissement a promu l'utilisation des gants non poudrés"]
[null,"1=Oui, 2=Non"]
[null,"Le principe d'utilisation UN GESTE = UNE PAIRE DE GANTS est respecté"]
[null,"1=Oui, 2=Non"]
[]
["IV-4 LES PRECAUTIONS COMPLEMENTAIRES"]
[]
[null,"Les précautions complémentaires font l'objet d'une information dans l'établissement"]
[null,"1=Oui, 2=Non"]
[]
[null,"Concernant les procédures des précautions complémentaires, il existe celles:"]
[null,"          - de type contact"]
[null,"1=Oui, 2=Non"]
[null,"          - de type gouttelettes"]
[null,"1=Oui, 2=Non"]
[null,"          - de type air"]
[null,"1=Oui, 2=Non"]
[null,"Il existe une signalisation lors de la mise en œuvre des précautions complémentaires"]
[null,"1=Oui, 2=Non"]
[]
["IV-5 HYGIENE DES RESIDENTS"]
[]
[null,"La toilette et les soins de nursing sont organisés et planifiés"]
[null,"1=Oui, 2=Non"]
[null,"La surveillance de l'état bucco-dentaire est organisée dans l'établissement"]
[null,"1=Oui, 2=Non"]
[null,"Le lavage des mains et/ou PHA est appliqué aux résidents"]
[null,"1=Oui, 2=Non"]
[]
[]
[null,"MENU"]
[]
[null,"CHAPITRE V"]

{"sheet":"Score5","index":26,"n_rows":2,"n_cols":14,"rows_kept":2,"cut":false,"hidden":true,"merged":[]}
["CODETAB","FINESS","VAC1","VAC2","VAC3","VAC4","VAC5","VAC6","VAC7","VAC8","VAC9","NUM5","DENOM5","SCORE5"]
[{"$f":"CODE","v":0},{"$f":"FINESS","v":0},{"$f":"IF(CHAPV!C2=1,1,0)","v":0},{"$f":"IF(CHAPV!D2=1,1,0)","v":0},{"$f":"IF(CHAPV!E2=1,1,0)","v":0},{"$f":"IF(CHAPV!F2=1,1,0)","v":0},{"$f":"IF(CHAPV!G2=1,1,0)","v":0},{"$f":"IF(CHAPV!H2=\"\",0,IF(CHAPV!H2>80%,3,IF(CHAPV!H2>50%,2,1)))","v":0},{"$f":"IF(CHAPV!I2=\"\",0,IF(CHAPV!I2>50%,2,1))","v":0},{"$f":"IF(CHAPV!J2=\"\",0,IF(CHAPV!J2>80%,3,IF(CHAPV!J2>50%,2,1)))","v":0},{"$f":"IF(CHAPV!K2=\"\",0,IF(CHAPV!K2>80%,3,IF(CHAPV!K2>50%,2,1)))","v":0},{"$f":"SUM(C2:K2)","v":0},16,{"$f":"L2/M2*100","v":0}]

{"sheet":"CHAPV","index":27,"n_rows":2,"n_cols":11,"rows_kept":2,"cut":false,"hidden":true,"merged":[]}
["CODETAB","FINESS","VACCIRES","VACCIPRO","GRIPRO","VACCIPNEUMO","RAPPEL","PCRES","PCSOIG","PCPNEUMO","PCCOQ"]
[{"$f":"CODE","v":0},{"$f":"FINESS","v":0},{"$f":"'Chapitre V'!C8","v":0},{"$f":"'Chapitre V'!C10","v":0},{"$f":"'Chapitre V'!C12","v":0},{"$f":"'Chapitre V'!C14","v":0},{"$f":"'Chapitre V'!C16","v":0},{"$f":"IF('Chapitre V'!C20=\"\",\"\",'Chapitre V'!C20)","v":""},{"$f":"IF('Chapitre V'!C22=\"\",\"\",'Chapitre V'!C22)","v":""},{"$f":"IF('Chapitre V'!C24=\"\",\"\",'Chapitre V'!C24)","v":""},{"$f":"IF('Chapitre V'!C26=\"\",\"\",'Chapitre V'!C26)","v":""}]

{"sheet":"Eval 4","index":28,"n_rows":30,"n_cols":17,"rows_kept":30,"cut":false,"hidden":false,"merged":[[0,2,0,3],[25,0,26,0],[15,1,17,1],[15,2,17,2],[15,3,17,3],[21,8,21,12],[2,0,2,1],[3,0,12,0],[13,0,14,0],[20,0,24,0],[15,4,17,4],[15,0,19,0]]}
[null,"Renseigner les cases bleu pâle:",null,null,null,"Renseigner obligatoirement"]
[]
["Gestion des soins",null,"Fréquence","Gravité","Risque  ","Actions Proposées en comité de pilotage","Validation",null,"Suivi autoévaluation GREPHH\n(à renseigner obligatoirement)",{"$f":"EHPAD!B7","v":2018},{"$f":"J3+1","v":2019},{"$f":"K3+1","v":2020},2021,2022,2023,2024,2025]
["Actes IDE et nursing","Risque de pneumopathie d'inhalation",1,4,{"$f":"IF(OR(AND(C4<=3,D4=1),AND(C4=1,D4=2),AND(C4=1,D4=3)),\"Risque faible\",IF(OR(AND(C4=4,D4=1),AND(C4=3,D4=2),AND(C4=2,D4=2),AND(C4=2,D4=3),AND(C4=1,D4=4)),\"Risque moyen\",IF(OR(AND(C4=4,D4=2),AND(C4=3,D4=3),AND(C4=4,D4=3),AND(C4=2,D4=4),AND(C4=3,D4=4),AND(C4=4,D4=4)),\"Risque élevé\",\" \")))","v":"Risque moyen"},"Organiser une réévaluation périodique des troubles de la déglutition avec protocole d'adaptation des textures",null,null,"Actes infirmiers et nursing"]
[null,"Risque d'infection urinaire basse",1,2,{"$f":"IF(OR(AND(C5<=3,D5=1),AND(C5=1,D5=2),AND(C5=1,D5=3)),\"Risque faible\",IF(OR(AND(C5=4,D5=1),AND(C5=3,D5=2),AND(C5=2,D5=2),AND(C5=2,D5=3),AND(C5=1,D5=4)),\"Risque moyen\",IF(OR(AND(C5=4,D5=2),AND(C5=3,D5=3),AND(C5=4,D5=3),AND(C5=2,D5=4),AND(C5=3,D5=4),AND(C5=4,D5=4)),\"Risque élevé\",\" \")))","v":"Risque faible"},"Réévaluer les pratiques concernant la prise en charge de l'hydratation des résidents",null,null,"Antiseptiques"]
[null,"Risque de pyelonéphrite ou prostatite",1,3,"Risque faible","Texte libre gestion des soins 0",null,null,"Précautions standard"]
[null,"Risque d'infection sur dispositif invasif (SAD)",1,3,"Risque faible","Réévaluer la procédure pose et entretien d'une sonde vésicale et faire une information aux soignant sur les bonnes pratiques",null,null,"Précautions complémentaires"]
[null,"Risque d'infection sur dispositif invasif (perfusion sous cutanée)",1,3,"Risque faible","Réévaluer la procédure perfusion sous cutanée et faire une information aux soignants sur les bonnes pratiques",null,null,"Hygiène des résidents"]
[null,"Risque d'escarre ou d'ulcère infecté",1,3,"Risque faible","Organiser une réévaluation périodique des résidents pour ajuster les matelas et coussins en fonction de leur risque d'escarre (Norton ou Braden) - refaire une information sur les précautions standard aux soignants\nNe pas faire de prélèvement cutané",null,null,"Gobal gestion des soins"]
[null,"Risque d'infection stomatologique",1,2,"Risque faible","Pour le suivi de l'hygiène buccodentaire, prendre contact avec le réseau bucco dentaire du territoire"]
[null,"Défaut de traçabilité de la surveillance des dispositifs invasifs",1,2,"Risque faible","Mettre en place une traçabilité de la surveillance des dispositifs invasifs",null,null,"Consommations\n(à renseigner obligatoirement)",{"$f":"J3","v":2018},{"$f":"J11+1","v":2019},{"$f":"K11+1","v":2020},2021,2022,2023,2024,2025]
[null,"Texte libre actes 1",1,3,"Risque faible","Texte libre actes 1",null,null,"Consommation SHA (litres)"]
[null,"Texte libre actes 2",1,3,"Risque faible","Texte libre actes 2",null,null,"Nombre de friction par JH",{"$f":"J12/(EHPAD!B9*0.003)","v":{"$error":"#DIV/0!"}},{"$f":"K12/(EHPAD!C9*0.003)","v":{"$error":"#DIV/0!"}},{"$f":"L12/(EHPAD!D9*0.003)","v":{"$error":"#DIV/0!"}},{"$f":"M12/(EHPAD!E9*0.003)","v":{"$error":"#DIV/0!"}},{"$f":"N12/(EHPAD!F9*0.003)","v":{"$error":"#DIV/0!"}},{"$f":"O12/(EHPAD!G9*0.003)","v":{"$error":"#DIV/0!"}},{"$f":"P12/(EHPAD!H9*0.003)","v":{"$error":"#DIV/0!"}},{"$f":"Q12/(EHPAD!I9*0.003)","v":{"$error":"#DIV/0!"}}]
["Antiseptiques","Texte libre antiseptiques 1",1,3,"Risque faible","Réaliser la désinfection cutanée en 4 temps en cas de souillure visible",null,null,"Consommation Tabliers UU"]
[null,"Texte libre antiseptiques 2",1,3,"Risque faible","Texte libre antiseptiques 2",null,null,"Nombre de tabliers UU par JH",{"$f":"J14/EHPAD!B9","v":{"$error":"#DIV/0!"}},{"$f":"K14/EHPAD!C9","v":{"$error":"#DIV/0!"}},{"$f":"L14/EHPAD!D9","v":{"$error":"#DIV/0!"}},{"$f":"M14/EHPAD!E9","v":{"$error":"#DIV/0!"}},{"$f":"N14/EHPAD!F9","v":{"$error":"#DIV/0!"}},{"$f":"O14/EHPAD!G9","v":{"$error":"#DIV/0!"}},{"$f":"P14/EHPAD!H9","v":{"$error":"#DIV/0!"}},{"$f":"Q14/EHPAD!I9","v":{"$error":"#DIV/0!"}}]
["PS","Non respect des Précautions Standard (cf. zéro bijou, SHA, tabliers UU, excellence excéta)",1,3,"Risque faible","Organiser une journée hygiène des mains et faire plusieurs fois par an un audit zéro bijou"]
[null,null,null,null,null,"Promouvoir les précautions standard lors des soins de nursing et change",null,null,"Audit zéro bijou\n(à renseigner obligatoirement)",{"$f":"J11","v":2018},{"$f":"J17+1","v":2019},{"$f":"K17+1","v":2020},2021,2022,2023,2024,2025]
[null,null,null,null,null,"Commencer / continuer le suivi de la consommation du SHA et des tabliers UU et vérifier la norme de virucidie du SHA: NF EN 14 476 contre le norovirus",null,null,"Conformité 0 bijou"]
[null,"Texte libre PS 1",1,3,"Risque faible","Texte libre PS 1",null,null,"Conformité des ongles"]
[null,"Texte libre PS 2",1,3,"Risque faible","Texte libre PS 2",null,null,"Conformité globale"]
["PCH","Absence de prescription de PCH ",1,3,"Risque faible","Organiser la prescription des précautions complémentaires d'hygiène par les médecins référents"]
[null,"Défaut d'information des professionnels en cas de PCH",1,3,"Risque faible","Faire apparaitre les PCH dans le plan de soins",null,null,"Fréquence des actes à risque infectieux"]
[null,"Défaut d'information du résident et/ou de sa famille en cas de PCH",1,2,"Risque faible","Utiliser les fiches d'information du CCLIN afin d'informer les résidents et leurs visiteurs sur les règles d'hygiène à appliquer en fonction du risque infectieux",null,null,"FREQUENCE","Jamais","Peu fréquent (quelques fois/an)","Fréquent (1 x/mois)","Très fréquent (1x/semaine)"]
[null,"Texte libre PCH 1",1,3,"Risque faible","Texte libre PCH 1",null,null,"Soins de plaies étendues"]
[null,"Texte libre PCH 2",1,3,"Risque faible","Texte libre PCH 2",null,null,"Sondage vésical"]
["Hygiène des résidents","Texte libre Hygiène des résidents 1",1,2,"Risque faible","Texte libre Hygiène des résidents 1",null,null,"Pose de cathéter sous cutané"]
[null,"Texte libre Hygiène des résidents 2",1,2,"Risque faible","Texte libre Hygiène des résidents 2",null,null,"Pose de cathéter périphérique"]
[null,null,null,null,null,null,null,null,"Sonde de Gastrostomie"]
[null,null,null,null,null,null,null,null,"…"]
[null,null,null,null,null,null,null,null,"…"]

{"sheet":"Outils 4","index":29,"n_rows":22,"n_cols":9,"rows_kept":22,"cut":false,"hidden":false,"merged":[[14,0,14,1],[15,8,15,14],[17,8,17,14],[21,0,21,1],[22,0,22,1],[15,0,15,1],[16,0,16,1],[17,0,17,1],[18,0,18,1],[18,8,18,14],[20,8,20,14],[21,8,21,14],[3,0,3,1],[4,0,4,1],[6,0,6,1],[7,0,7,1],[8,0,8,1],[4,8,4,14],[5,8,5,14],[7,8,7,14],[19,0,19,1],[20,0,20,1],[5,0,5,1],[11,0,11,1],[9,0,9,1],[10,0,10,1],[8,8,8,14],[10,8,10,14],[11,8,11,14],[13,8,13,14],[12,0,12,1],[13,0,13,1],[14,8,14,14]]}
[]
[null,null,null,"F : Formations aux bonnes pratiques professionnelles"]
[null,null,null,"R : Révision des procédures avec IDE hygiéniste"]
["Soins effectués",null,null,2018,2019,2020,2021]
["Aérosol thérapie",null,null,null,null,null,null,null,"üAudits zéro bijou "]
["Alimentation entérale",null,null,null,null,null,null,null,"http://www.cpias.fr/campagnes/hygiene_mains/zero_bijou.html"]
["Aspiration buccale ou bronchique"]
["Hygiène des mains et port de gants",null,null,null,null,null,null,null,"üAudit hygiène des mains"]
["Injections IM",null,null,null,null,null,null,null,"https://www.preventioninfection.fr/boites-a-outils/hygiene-des-mains/"]
["Injections S/C"]
["Injections IV",null,null,null,null,null,null,null,"üPrécautions standard"]
["Oxygénothérapie",null,null,null,null,null,null,null,"http://www.cpias-auvergnerhonealpes.fr/stoprisk/index.html"]
["Plaies (escarres,ulcères…)"]
["Pose d'une voie veineuse périphérique",null,null,null,null,null,null,null,"üChange au lit d’un patient dépendant dans les établissements de santé et médico-sociaux"]
["Pose d'une perfusion sous cutanée",null,null,null,null,null,null,null,"http://www.cpias-ile-de-france.fr/REGION/NPC/excreta/AuditChange_fichetech.pdf"]
["Précautions complémentaires"]
["Précautions standard"]
["Prélèvement veineux",null,null,null,null,null,null,null,"üKit hygiène des mains"]
["Soins de nursing (toilette, soins bucco dentaires)",null,null,null,null,null,null,null,"http://www.cpias-ile-de-france.fr/docprocom/hygiene-des-mains.php"]
["Sondage vésical"]
["Stomies",null,null,null,null,null,null,null,"üLes gants au bon moment"]
[null,null,null,null,null,null,null,null,"http://www.cpias-auvergnerhonealpes.fr/gants_au_bon_moment/accueil.html"]

{"sheet":"Chapitre V","index":30,"n_rows":32,"n_cols":2,"rows_kept":32,"cut":false,"hidden":false,"merged":[[0,0,0,2],[1,0,1,2]]}
["CHAPITRE V"]
["LES VACCINATIONS CONTRE LES AFFECTIONS RESPIRATOIRES"]
[]
[]
[]
["Rappel: ","les données sont à saisir dans les cellules vert pâle. Saisie obligatoire pour tous les critères proposés."]
[]
[null,"L'établissement organise la vaccination antigrippale des résidents"]
[null,"1=Oui, 2=Non"]
[null,"L'établissement encourage la vaccination antigrippale de tout le personnel de l'EHPAD"]
[null,"1=Oui, 2=Non"]
[null,"L'établissement prend en charge la vaccination antigrippale de tout le personnel "]
[null,"1=Oui, 2=Non"]
[null,"L'établissement procède à la vaccination anti-pneumococcique des résidents"]
[null,"1=Oui, 2=Non"]
[null,"L'établissement veille au rappel de la vaccination anticoquelucheuse des personnels"]
[null,"1=Oui, 2=Non"]
[null,"Indicateurs de suivi:"]
[null,"Pouvez-vous donner pour le dernier hiver:"]
[null,"     - Le pourcentage de résidents vaccinés contre la grippe"]
[]
[null,"     - Le pourcentage de soignants vaccinés contre la grippe"]
[]
[null,"     - Le pourcentage de résidents vaccinés contre les pneumocoques"]
[]
[null,"     - Le pourcentage de personnels vaccinés contre la coqueluche"]
[]
[]
[]
[null,"MENU"]
[]
[null,"CHAPITRE VI"]

{"sheet":"Score6","index":31,"n_rows":2,"n_cols":45,"rows_kept":2,"cut":false,"hidden":true,"merged":[]}
["CODETAB","FINESS","GALE1","GALE2","GALE3","GALE4","GALE5","GALE6","GALE7","GALE","DENOMGALE","TUB1","TUB2","TUB3","TUB4","TUB5","TUB6","TUB7","TUB8","TUB9","TUB10","TUB","DENOMTUB","GASTRO1","GASTRO2","GASTRO3","GASTRO4","GASTRO5","GASTRO","DENOMGASTRO","IRA1","IRA2","IRA3","IRA4","IRA5","IRA6","IRA","DENOMIRA","SCORE6A","SCORE6B","SCORE6C","SCORE6D","NUM6","DENOM6","SCORE6"]
[{"$f":"CODE","v":0},{"$f":"FINESS","v":0},{"$f":"IF(CHAPVI!C2=1,1,0)","v":0},{"$f":"IF(AND(CHAPVI!D2=1,CHAPVI!E2=1,CHAPVI!F2=1),1,0)","v":0},{"$f":"IF(CHAPVI!G2=1,1,0)","v":0},{"$f":"IF(CHAPVI!H2=1,1,0)","v":0},{"$f":"IF(CHAPVI!J2=1,1,0)","v":0},{"$f":"IF(CHAPVI!K2=1,1,0)","v":0},{"$f":"IF(CHAPVI!L2=1,1,0)","v":0},{"$f":"SUM(C2:I2)","v":0},7,{"$f":"IF(CHAPVI!M2=1,1,0)","v":0},{"$f":"IF(AND(CHAPVI!N2=1,CHAPVI!O2=1,CHAPVI!P2=1),1,0)","v":0},{"$f":"IF(CHAPVI!Q2=1,1,0)","v":0},{"$f":"IF(CHAPVI!R2=1,1,0)","v":0},{"$f":"IF(CHAPVI!S2=1,1,0)","v":0},{"$f":"IF(CHAPVI!T2=1,1,0)","v":0},{"$f":"IF(CHAPVI!U2=1,1,0)","v":0},{"$f":"IF(CHAPVI!V2=1,1,0)","v":0},{"$f":"IF(CHAPVI!X2=1,1,0)","v":0},{"$f":"IF(CHAPVI!Y2=1,1,0)","v":0},{"$f":"SUM(L2:U2)","v":0},10,{"$f":"IF(CHAPVI!Z2=1,1,0)","v":0},{"$f":"IF(AND(CHAPVI!AA2=1,CHAPVI!AB2=1,CHAPVI!AC2=1),1,0)","v":0},{"$f":"IF(CHAPVI!AD2=1,1,0)","v":0},{"$f":"IF(CHAPVI!AE2=1,1,0)","v":0},{"$f":"IF(CHAPVI!AF2=1,1,0)","v":0},{"$f":"SUM(X2:AB2)","v":0},5,{"$f":"IF(CHAPVI!AK2=1,1,0)","v":0},{"$f":"IF(AND(CHAPVI!AL2=1,CHAPVI!AM2=1,CHAPVI!AN2=1),1,0)","v":0},{"$f":"IF(CHAPVI!AO2=1,1,0)","v":0},{"$f":"IF(CHAPVI!AP2=1,1,0)","v":0},{"$f":"IF(CHAPVI!AQ2=1,1,0)","v":0},{"$f":"IF(CHAPVI!AR2=1,1,0)","v":0},{"$f":"SUM(AE2:AJ2)","v":0},6,{"$f":"J2/K2*100","v":0},{"$f":"V2/W2*100","v":0},{"$f":"AC2/AD2*100","v":0},{"$f":"AK2/AL2*100","v":0},{"$f":"J2+V2+AC2+AK2","v":0},{"$f":"K2+W2+AD2+AL2","v":28},{"$f":"AQ2/AR2*100","v":0}]

{"sheet":"CHAPVI","index":32,"n_rows":2,"n_cols":44,"rows_kept":2,"cut":false,"hidden":true,"merged":[]}
["CODETAB","FINESS","GALEPROTO","GALECRIT","GALEVAL","GALEDIF","PRODUIT","LEVEE","CHAMBRE","ACARIEN","INFO","DOSSIER","TUBERPROTO","TUBERECRITE","TUBERVAL","TUBERDIF","CVGAS","CLAT","MEDTRAV","AVIS","MEDECINE","DEPISTAGE","PRECAUTION","MASQUE","FFP1","GASTROCAT","GASTROECRITE","GASTROVAL","GASTRODIF","CONTACT","MAINTIEN","JAVEL","INFORESID","INFOCONSEIL","INFOSALARIE","INFOFAMILLE","IRACAT","IRAECRITE","IRAVAL","IRADIF","GOUTTE","CHIR","QUITTE","ACTIVITE"]
[{"$f":"CODE","v":0},{"$f":"FINESS","v":0},{"$f":"'Chapitre VI'!C12","v":0},{"$f":"'Chapitre VI'!C15","v":0},{"$f":"'Chapitre VI'!C17","v":0},{"$f":"'Chapitre VI'!C19","v":0},{"$f":"'Chapitre VI'!C21","v":0},{"$f":"'Chapitre VI'!C23","v":0},{"$f":"'Chapitre VI'!C25","v":0},{"$f":"'Chapitre VI'!C27","v":0},{"$f":"'Chapitre VI'!C29","v":0},{"$f":"'Chapitre VI'!C31","v":0},{"$f":"'Chapitre VI'!C36","v":0},{"$f":"'Chapitre VI'!C39","v":0},{"$f":"'Chapitre VI'!C41","v":0},{"$f":"'Chapitre VI'!C43","v":0},{"$f":"'Chapitre VI'!C45","v":0},{"$f":"'Chapitre VI'!C47","v":0},{"$f":"'Chapitre VI'!C49","v":0},{"$f":"'Chapitre VI'!C51","v":0},{"$f":"'Chapitre VI'!C53","v":0},{"$f":"'Chapitre VI'!C55","v":0},{"$f":"'Chapitre VI'!C57","v":0},{"$f":"'Chapitre VI'!C59","v":0},{"$f":"'Chapitre VI'!C61","v":0},{"$f":"'Chapitre VI'!C66","v":0},{"$f":"'Chapitre VI'!C69","v":0},{"$f":"'Chapitre VI'!C71","v":0},{"$f":"'Chapitre VI'!C73","v":0},{"$f":"'Chapitre VI'!C75","v":0},{"$f":"'Chapitre VI'!C78","v":0},{"$f":"'Chapitre VI'!C80","v":0},{"$f":"'Chapitre VI'!C84","v":0},{"$f":"'Chapitre VI'!C86","v":0},{"$f":"'Chapitre VI'!C88","v":0},{"$f":"'Chapitre VI'!C90","v":0},{"$f":"'Chapitre VI'!C95","v":0},{"$f":"'Chapitre VI'!C98","v":0},{"$f":"'Chapitre VI'!C100","v":0},{"$f":"'Chapitre VI'!C102","v":0},{"$f":"'Chapitre VI'!C104","v":0},{"$f":"'Chapitre VI'!C106","v":0},{"$f":"'Chapitre VI'!C108","v":0},{"$f":"'Chapitre VI'!C110","v":0}]

{"sheet":"Eval 5","index":33,"n_rows":16,"n_cols":13,"rows_kept":16,"cut":false,"hidden":false,"merged":[[0,1,0,2],[12,3,12,12],[13,3,13,12],[14,3,14,12],[15,3,15,12],[11,3,11,12]]}
["Renseigner les cases bleu pâle:",null,null,"Renseigner obligatoirement"]
[]
["Actions Proposées en comité de pilotage","Validation",null,"Suivi des taux de vaccination\n",{"$f":"EHPAD!B7","v":2018},{"$f":"E3+1","v":2019},{"$f":"F3+1","v":2020},2021,2022,2023,2024,2025,"Nom ou codification des éléments de preuve"]
["faire une campagne annuelle de vaccination antigrippale ",null,null,"Nombre soignants vaccinés contre la grippe\n(à renseigner obligatoirement)"]
["faire une campagne de sensibilisation des médécins traitants sur la vaccination antipneumococcique",null,null,"Taux de soignants vacciné contre la grippe",{"$f":"E4/EHPAD!B14","v":{"$error":"#DIV/0!"}},{"$f":"F4/EHPAD!C14","v":{"$error":"#DIV/0!"}},{"$f":"G4/EHPAD!D14","v":{"$error":"#DIV/0!"}},{"$f":"H4/EHPAD!E14","v":{"$error":"#DIV/0!"}},{"$f":"I4/EHPAD!F14","v":{"$error":"#DIV/0!"}},{"$f":"J4/EHPAD!G14","v":{"$error":"#DIV/0!"}},{"$f":"K4/EHPAD!H14","v":{"$error":"#DIV/0!"}},{"$f":"L4/EHPAD!I14","v":{"$error":"#DIV/0!"}}]
["Proposer la vaccination contre le pneumocoque aux résidents à l'entrée en institution si pas de vaccination récente",null,null,"Taux de résidents vaccinés contre la grippe\n(à renseigner obligatoirement)"]
["Réaliser le suivi du nombre de résidents à jour de leur vaccination antipneumococcique",null,null,"Nombre résidents vaccinés contre le pneumocoque"]
["Sensibiliser le personnel à réaliser un rappel de vaccination contre la coqueluche le cas échéant",null,null,"Taux de résidents vaccinés contre le pneumocoque",{"$f":"E7/(Etablissement!$E$24*EHPAD!B8)","v":{"$error":"#DIV/0!"}},{"$f":"F7/(Etablissement!$E$24*EHPAD!C8)","v":{"$error":"#DIV/0!"}},{"$f":"G7/(Etablissement!$E$24*EHPAD!D8)","v":{"$error":"#DIV/0!"}},{"$f":"H7/(Etablissement!$E$24*EHPAD!E8)","v":{"$error":"#DIV/0!"}},{"$f":"I7/(Etablissement!$E$24*EHPAD!F8)","v":{"$error":"#DIV/0!"}},{"$f":"J7/(Etablissement!$E$24*EHPAD!G8)","v":{"$error":"#DIV/0!"}},{"$f":"K7/(Etablissement!$E$24*EHPAD!H8)","v":{"$error":"#DIV/0!"}},{"$f":"L7/(Etablissement!$E$24*EHPAD!I8)","v":{"$error":"#DIV/0!"}}]
["Texte libre Vaccination 1",null,null,"Suivi autoévaluation du GREPHH Vaccinations"]
[]
[]
[null,null,null,"Réglementation"]
[null,null,null,"Arrêté du 2 août 2013 fixant les conditions d'immunisation des personnes mentionnées à l'article L.3111-4 du code de la santé publique"]
[null,null,null,"Décret n°2006-1260 du 14 octobre 2006 pris en application  de l'article L.3111-4 du code de la santé publique et relatif à l'obligation vaccinale contre la grippe des professionnels mentionnés à l'article L.3111-4 du même code"]
[null,null,null,"Note d'information du 14 septembre 2018 relative à la vaccination contre la grippe saisonnière des personnels des établissements sanitaires et médico-sociaux"]
[null,null,null,"La vaccination du personnel est à promouvoir et à organiser en lien avec le service de médecine du travail."]

{"sheet":"Outils 5","index":34,"n_rows":8,"n_cols":2,"rows_kept":8,"cut":false,"hidden":false,"merged":[[3,1,3,7],[5,1,5,6],[7,1,8,17]]}
[]
[]
[null,"Campagne de vaccination antigrippale"]
[null,"http://www.cpias-auvergnerhonealpes.fr/grippe_vacciner_c_est_proteger/accueil.html\n"]
[]
[null," Vaccination info service"]
[]
[null,"http://vaccination-info-service.fr/Questions-pratiques/Dois-je-me-faire-vacciner/Comment-savoir-quels-vaccins-faire?gclid=CMjynu3u3dQCFXAA0wodbgAJxA#xtor=SEC-40-GOO-[Calendrier_Vaccinal]--S-[calendrier%20vaccinal]"]

{"sheet":"Chapitre VI","index":35,"n_rows":116,"n_cols":2,"rows_kept":116,"cut":false,"hidden":false,"merged":[[0,0,0,2],[1,0,1,2]]}
["CHAPITRE VI"]
["GESTION DES RISQUES EPIDEMIQUES"]
[]
[]
[]
["Rappel: ","les données sont à saisir dans les cellules vert pâle. Saisie obligatoire pour tous les critères proposés."]
[null,"Pour certaines questions, lorsqu'une réponse négative est donnée, les questions suivantes apparaissent en gris:"]
[null,"vous n'avez pas à y répondre."]
[]
["VI-1 GALE"]
[]
[null,"Il existe un protocole dans l'établissement pour faire face à un cas de gale"]
[null,"1=Oui, 2=Non"]
[null,"Si oui, il est:"]
[null,"    - écrit"]
[null,"1=Oui, 2=Non"]
[null,"    - validé"]
[null,"1=Oui, 2=Non"]
[null,"    - diffusé"]
[null,"1=Oui, 2=Non"]
[null,"Des produits (Ivermectine) pour le traitement des personnes atteintes peuvent être mis à disposition du personnel"]
[null,"1=Oui, 2=Non"]
[null,"La mise en place et la levée des mesures précautions complémentaires de type contact font l'objet d'une prescription médicale"]
[null,"1=Oui, 2=Non"]
[null,"Le patient reste dans sa chambre jusqu'à la réalisation d'un traitement curatif"]
[null,"1=Oui, 2=Non"]
[null,"Des produits anti-acariens pour le traitement du linge et autres matériels non lavables à 60° C peuvent être mis à disposition"]
[null,"1=Oui, 2=Non"]
[null,"Une procédure et une traçabilité de l'information au résident et à sa famille sont opérationnelles"]
[null,"1=Oui, 2=Non"]
[null,"La gale est notifiée dans le dossier du résident"]
[null,"1=Oui, 2=Non"]
[]
["VI-2 TUBERCULOSE PULMONAIRE"]
[]
[null,"Il existe un protocole dans l'établissement pour faire face à un cas de suspicion de tuberculose"]
[null,"1=Oui, 2=Non"]
[null,"La conduite à tenir devant un cas de tuberculose est:"]
[null,"     - écrite"]
[null,"1=Oui, 2=Non"]
[null,"     - validée (médecin coordonnateur)"]
[null,"1=Oui, 2=Non"]
[null,"     - diffusée"]
[null,"1=Oui, 2=Non"]
[null,"La déclaration obligatoire est faite auprès de la CVGAS de l'ARS"]
[null,"1=Oui, 2=Non"]
[null,"Le centre de ressources est idéntifié (CLAT)"]
[null,"1=Oui, 2=Non"]
[null,"Le médecin du travail est systématiquement informé"]
[null,"1=Oui, 2=Non"]
[null,"Un avis spécialisé est demandé"]
[null,"1=Oui, 2=Non"]
[null,"Le malade est hospitalisé systématiquement dans un service de médecine"]
[null,"1=Oui, 2=Non"]
[null,"Des mesures de dépistage des résidents et du personnel sont prévues"]
[null,"1=Oui, 2=Non"]
[null,"Les précautions complémentaires type air sont prévues en attendant le transfert"]
[null,"1=Oui, 2=Non"]
[null,"     - Des masques chirurgicaux sont prévus pour le résident atteint"]
[null,"1=Oui, 2=Non"]
[null,"     - Des masques respitatoires (FFP1-FFP2) sont disponibles pour le personnel"]
[null,"1=Oui, 2=Non"]
[]
["VI-3 GASTRO-ENTERITE"]
[]
[null,"Il existe une conduite à tenir dans l'établissement pour faire face à une épidémie à partir de trois cas"]
[null,"1=Oui, 2=Non"]
[null,"Une procédure de prise en charge est:"]
[null,"     - écrite"]
[null,"1=Oui, 2=Non"]
[null,"     - validée par le médecin coordonnateur ou le directeur de l'établissement ou par l'instance de prévention des infections"]
[null,"1=Oui, 2=Non"]
[null,"     - diffusée"]
[null,"1=Oui, 2=Non"]
[null,"Les précautions complémentaires (contact) sont mises en place"]
[null,"1=Oui, 2=Non"]
[null,"En cas de résident suspect de diarrhée à Clostridium difficile:"]
[null,"     - le maintien dans sa chambre est priorisé"]
[null,"1=Oui, 2=Non"]
[null,"     - un traitement des locaux comportant une désinfection à l'Eau de Javel® diluée est prévu"]
[null,"1=Oui, 2=Non"]
[]
[null,"Dans le cadre de la gestion des risques épidémiques, une information est prévue vers:"]
[null,"     - les résidents"]
[null,"1=Oui, 2=Non"]
[null,"     - le Conseil de la vie sociale"]
[null,"1=Oui, 2=Non"]
[null,"     - les salariés"]
[null,"1=Oui, 2=Non"]
[null,"     - les familles"]
[null,"1=Oui, 2=Non"]
[]
["VI-4 INFECTION RESPIRATOIRE AIGUE BASSE"]
[]
[null,"Il existe une conduite à tenir dans l'établissement pour la prise en charge des résidents atteints d'infection respiratoire aiguë (IRA)"]
[null,"1=Oui, 2=Non"]
[null,"Cette conduite à tenir est:"]
[null,"    - écrite"]
[null,"1=Oui, 2=Non"]
[null,"    - validée (médecin coordonnateur)"]
[null,"1=Oui, 2=Non"]
[null,"    - diffusée"]
[null,"1=Oui, 2=Non"]
[null,"Les précautions complémentaires de type gouttelettes sont mises en place dans les situations d'IRA"]
[null,"1=Oui, 2=Non"]
[null,"Le port du masque chirurgical est indiqué pour le personnel effectuant des soins auprès des résidents atteints d'IRA"]
[null,"1=Oui, 2=Non"]
[null,"Il est demandé au résident atteint d'IRA de porter un masque chirurgical chaque fois qu'il quitte sa chambre"]
[null,"1=Oui, 2=Non"]
[null,"La participation à des activités de groupe est temporairement suspendue pour le résident atteint d'IRA"]
[null,"1=Oui, 2=Non"]
[]
[]
[null,"MENU"]
[]
[null,"CHAPITRE VII"]

{"sheet":"Score7","index":36,"n_rows":2,"n_cols":28,"rows_kept":2,"cut":false,"hidden":true,"merged":[]}
["CODETAB","FINESS","AES1","AES2","AES3","AES4","AES5","AES6","AES7","AES8","AES9","AES10","AES11","AES12","AES13","AES14","AES15","AES16","AES17","DENOMAES12","DENOMAES13","DENOMAES14","DENOMAES15","DENOMAES16","DENOMAES17","NUM7","DENOM7","SCORE7"]
[{"$f":"CODE","v":0},{"$f":"FINESS","v":0},{"$f":"IF(CHAPVII!C2=1,1,0)","v":0},{"$f":"IF(CHAPVII!D2=1,1,0)","v":0},{"$f":"IF(CHAPVII!E2=1,1,0)","v":0},{"$f":"IF(AND(CHAPVII!F2=1,CHAPVII!G2=1),1,0)","v":0},{"$f":"IF(CHAPVII!H2=1,1,0)","v":0},{"$f":"IF(CHAPVII!I2=1,1,0)","v":0},{"$f":"IF(CHAPVII!J2=1,1,0)","v":0},{"$f":"IF(CHAPVII!M2=1,1,0)","v":0},{"$f":"IF(CHAPVII!N2=1,1,0)","v":0},{"$f":"IF(CHAPVII!O2=1,1,0)","v":0},{"$f":"IF(CHAPVII!P2=1,1,0)","v":0},{"$f":"IF(CHAPVII!Q2=1,1,0)","v":0},{"$f":"IF(CHAPVII!R2=1,1,0)","v":0},{"$f":"IF(CHAPVII!S2=1,1,0)","v":0},{"$f":"IF(CHAPVII!T2=1,1,0)","v":0},{"$f":"IF(CHAPVII!U2=1,1,0)","v":0},{"$f":"IF(CHAPVII!V2=1,1,0)","v":0},{"$f":"IF(CHAPVII!Q2=3,0,1)","v":1},{"$f":"IF(CHAPVII!R2=3,0,1)","v":1},{"$f":"IF(CHAPVII!S2=3,0,1)","v":1},{"$f":"IF(CHAPVII!T2=3,0,1)","v":1},{"$f":"IF(CHAPVII!U2=3,0,1)","v":1},{"$f":"IF(CHAPVII!V2=3,0,1)","v":1},{"$f":"SUM(C2:S2)","v":0},{"$f":"SUM(T2:Y2,11)","v":17},{"$f":"Z2/AA2*100","v":0}]

{"sheet":"CHAPVII","index":37,"n_rows":2,"n_cols":22,"rows_kept":2,"cut":false,"hidden":true,"merged":[]}
["CODETAB","FINESS","VHB","FORMATION","PROCEDURE","PROCVAL","PROCDIF","CATAFF","VIH","SUIVI","TENDANCE","CHSCT","GANT","MASQUE","LUNETTE","COLLECTEUR","SANG","CAPIL","INJEC","VEINE","SSCUTA","STYLO"]
[{"$f":"CODE","v":0},{"$f":"FINESS","v":0},{"$f":"'Chapitre VII'!C10","v":0},{"$f":"'Chapitre VII'!C12","v":0},{"$f":"'Chapitre VII'!C14","v":0},{"$f":"'Chapitre VII'!C17","v":0},{"$f":"'Chapitre VII'!C19","v":0},{"$f":"'Chapitre VII'!C21","v":0},{"$f":"'Chapitre VII'!C23","v":0},{"$f":"'Chapitre VII'!C25","v":0},{"$f":"'Chapitre VII'!C27","v":0},{"$f":"'Chapitre VII'!C29","v":0},{"$f":"'Chapitre VII'!C33","v":0},{"$f":"'Chapitre VII'!C35","v":0},{"$f":"'Chapitre VII'!C37","v":0},{"$f":"'Chapitre VII'!C41","v":0},{"$f":"'Chapitre VII'!C43","v":0},{"$f":"'Chapitre VII'!C45","v":0},{"$f":"'Chapitre VII'!C47","v":0},{"$f":"'Chapitre VII'!C49","v":0},{"$f":"'Chapitre VII'!C51","v":0},{"$f":"'Chapitre VII'!C53","v":0}]

{"sheet":"Eval 6","index":38,"n_rows":24,"n_cols":17,"rows_kept":24,"cut":false,"hidden":false,"merged":[[0,2,0,3],[18,1,21,1],[18,2,21,2],[18,3,21,3],[18,4,21,4],[17,0,23,0],[2,0,2,1],[3,0,7,0],[8,0,10,0],[11,0,13,0],[14,0,16,0]]}
[null,"Renseigner les cases bleu pâle:",null,null,null,"Renseigner obligatoirement"]
[]
["Gestion des risques épidémiques",null,"Fréquence","Gravité","Risque  ","Actions Proposées en comité de pilotage","Validation",null,"Suivi autoévaluation GREPHH\n(à renseigner obligatoirement)",{"$f":"EHPAD!B7","v":2018},{"$f":"J3+1","v":2019},{"$f":"K3+1","v":2020},2021,2022,2023,2024,2025]
["GEA","Risque de non diagnostic d'Icd (recherche systématique toxine clostridium difficile en cas de diarrhée infectieuse?)",1,3,{"$f":"IF(OR(AND(C4<=3,D4=1),AND(C4=1,D4=2),AND(C4=1,D4=3)),\"Risque faible\",IF(OR(AND(C4=4,D4=1),AND(C4=3,D4=2),AND(C4=2,D4=2),AND(C4=2,D4=3),AND(C4=1,D4=4)),\"Risque moyen\",IF(OR(AND(C4=4,D4=2),AND(C4=3,D4=3),AND(C4=4,D4=3),AND(C4=2,D4=4),AND(C4=3,D4=4),AND(C4=4,D4=4)),\"Risque élevé\",\" \")))","v":"Risque faible"},"Organiser une recherche systématique de toxine de Clostridium difficile dans les selles en cas de diarrhée infectieuse",null,null,"Gale"]
[null,"Risque d'épidémie d'ICd",1,4,{"$f":"IF(OR(AND(C5<=3,D5=1),AND(C5=1,D5=2),AND(C5=1,D5=3)),\"Risque faible\",IF(OR(AND(C5=4,D5=1),AND(C5=3,D5=2),AND(C5=2,D5=2),AND(C5=2,D5=3),AND(C5=1,D5=4)),\"Risque moyen\",IF(OR(AND(C5=4,D5=2),AND(C5=3,D5=3),AND(C5=4,D5=3),AND(C5=2,D5=4),AND(C5=3,D5=4),AND(C5=4,D5=4)),\"Risque élevé\",\" \")))","v":"Risque moyen"},"Rajouter/vérifier dans la procédure l'application des précautions complémentaires Icd en cas de suspicion (surblouse manches longues UU gants lavage des mains avant SHA, eau de javel en 3 temps…cf.procédure CPias)",null,null,"Tuberculose"]
[null,"Risque d'épidémie de GEA",1,3,"Risque faible","Systématiser la FHA pour les résidents avant les activités collectives",null,null,"GEA"]
[null,"Texte libre GEA 1",1,3,"Risque faible","Texte libre GEA 1",null,null,"IRAB"]
[null,"Texte libre GEA 2",1,3,"Risque faible","Texte libre GEA 2",null,null,"Global épidémie"]
["IRAB","Risque d'épidémie d'IRA/grippe",1,4,"Risque moyen","Prévoir l'utililsation de TROD Grippe en période épidémique"]
[null,"Retard de vaccination antigrippale des résidents ",1,4,"Risque moyen","Anticiper l'impression des bons AMELI pour la vaccination antigrippale afin de faire une campagne de vaccination antigrippale dès début Octobre",null,null,"Nb Episodes infectieux associés aux soins \n(à renseigner obligatoirement)",{"$f":"J3","v":2018},{"$f":"J10+1","v":2019},{"$f":"K10+1","v":2020},2021,2022,2023,2024,2025]
[null,"Texte libre IRAB 1",1,3,"Risque faible","Texte libre IRAB 1",null,null,"Nb Epidémie de Gastro entérite aigue"]
["Tuberculose","Risque de tuberculose ",1,4,"Risque moyen","Prévoir un stock tampon de masques FFP2",null,null,"Taux d'attaque moyen GEA"]
[null,"Texte libre Tuberculose 1",1,3,"Risque faible","Texte libre Tuberculose 1",null,null,"Nb Epidémie d'Infection respiratoire aigue basse"]
[null,"Texte libre Tuberculose 2",1,3,"Risque faible","Texte libre Tuberculose 2",null,null,"Taux d'attaque moyen IRAB"]
["Gale","Risque d'épidémie de Gale",1,2,"Risque faible","Demander un avis dermatologue devant toute suspicion de gale, avec mise en place des précautions complémentaire gale en attente",null,null,"Cas de Tuberculose bacillifère"]
[null,"Texte libre Gale 1",1,2,"Risque faible","Texte libre Gale 1",null,null,"Gale "]
[null,"Texte libre Gale 2",1,2,"Risque faible","Texte libre Gale 2",null,null,"Légionellose"]
["Epidémie","Non respect des PCH",1,4,"Risque moyen","Faire ou refaire une information sur les précautions complémentaires auprès des soignants",null,null,"TIAC"]
[null,"Défaut de plan de maitrise d'une épidémie",1,3,"Risque faible","Rédiger le plan de maitrise d'une épidémie et l'inclure dans le DARI et le Plan Bleu",null,null,"Autres:"]
[null,null,null,null,null,"Déterminer une zone de cohorting pour les repas des résidents atteints d'IRA ou GEA, lorsque les repas en chambre ne peuvent plus être assurés compte tenu du nombre de cas",null,null,"Signalements ARS"]
[null,null,null,null,null,"Déterminer un stock tampon concernant les masques chirurgicaux, masques FFP2, tabliers UU, surblouses manches longues UU, eau de javel… à inclure au plan de maitrise d'épidémie. Cf renseigner le tableau onglet'Plan de maîtrise épidémie'"]
[null,null,null,null,null,"Prévoir une procédure d'information à destination des intervenants extérieurs en cas d'épidémie"]
[null,"Texte libre épidémie 1",1,3,"Risque faible","Texte libre épidémie 1"]
[null,"Texte libre épidémie 2",1,3,"Risque faible","Texte libre épidémie 2"]

{"sheet":"Plan de maitrise épidémie ","index":39,"n_rows":62,"n_cols":7,"rows_kept":62,"cut":false,"hidden":false,"merged":[[9,6,9,7],[23,1,23,3],[38,4,38,5],[34,0,34,5],[32,1,32,3],[32,4,32,5],[24,1,24,3],[25,1,25,3],[26,1,26,3],[27,1,27,3],[28,1,28,3],[28,4,28,5],[29,4,29,5],[30,4,30,5],[31,4,31,5],[30,1,30,3],[31,1,31,3],[3,1,3,5],[22,4,22,5],[23,4,23,5],[24,4,24,5],[19,4,19,5],[20,4,20,5],[21,4,21,5],[19,1,19,3],[20,1,20,3],[21,1,21,3],[17,0,17,5],[27,4,27,5],[22,1,22,3],[6,1,6,5],[6,0,7,0],[45,0,47,0],[48,0,50,0],[51,0,53,0],[47,1,47,2],[38,1,38,2],[39,1,39,2],[40,1,40,2],[41,1,41,2],[42,1,42,2],[39,0,44,0],[13,0,13,5],[14,0,14,5],[15,0,15,6],[26,4,26,5],[25,4,25,5],[29,1,29,3],[57,0,57,5],[61,0,61,5],[36,0,36,5],[49,4,50,4],[49,5,50,5],[53,1,53,2],[48,1,48,2],[49,1,49,2],[50,1,50,2],[51,1,51,2],[52,1,52,2],[43,1,43,2],[44,1,44,2],[45,1,45,2],[46,1,46,2]]}
[]
[]
[]
[null,"CORRESPONDANTS"]
[null,"Noms","Adresse","Adresse mail","Téléphone","Fax"]
["ARS","Ile de France","ARS Ile-de-France\n13 rue du Landy, 93200 Saint-Denis","ars75-alerte@ars.sante.fr",825811411,"01 44 02 06 76"]
["CPIAS","http://www.cpias-ile-de-france.fr/"]
[null,null,"8 rue Maria Helena Vieira da Silva             75014 Paris",null,"01 40 27 42 00","01 40 27 42 51"]
["CIRE","Cellule Ile-de-France  Santé publique France","ARS Ile-de-France\n13 rue du Landy, 93200 Saint-Denis","cire-idf@santepubliquefrance.fr","01 44 02 08 16","01 44 02 06 76"]
["CLAT","CLAT ESSONNE","Bd de France 91012 EVRY Cedex","clat91@cd-essonne.fr","01 60 91 99 05","01 60 77 05 10","https://www.geres.org/tuberculose/"]
["AUTRES"]
["AUTRES"]
[]
["Essentiel du Plan de maitrise d'une épidémie"]
[]
["Extrait du \"guide d'aide à l'élaboration du DARI\" ARS DT 91, 2012"]
[]
["1. L’ alerte \nLa cellule d’alerte traite un signal et met en place rapidement les actions correctives et de prévention. Elle évolue en cellule de crise lorsque la crise est avérée.\nDifférentes étapes sont nécessaires pour la mise en œuvre de ce dispositif \n\n1. Déclenchement\nDès connaissance de l’alerte ou de la crise interne ou externe, le directeur :\n- S’informe des éléments constitutifs de la situation  \n- Active la cellule d’alerte ou de crise. \n\n2. Mise en place de la cellule d’alerte ou de crise\nLe directeur, ou son représentant légal nomme l’équipe qui fera partie intégrante de la cellule d’alerte ou de crise. \nEn fonction de l’alerte ou de la crise, le directeur pourra adapter la cellule en faisant appel, si nécessaire, à des experts externes à l’établissement (équipe d’hygiène, ARLIN, médecin du travail,...)."]
[]
["2. Membres de la cellule de crise épidémie et risque infectieux","Nom et Prénom",null,null,"coordonnées téléphoniques professionnelles"]
["Le Directeur",{"$f":"EHPAD!B17","v":0},null,null,{"$f":"EHPAD!C17","v":0}]
["Le représentant du directeur en cas d’absence"]
["Le médecin coordonnateur de l’établissement",{"$f":"EHPAD!B18","v":0},null,null,{"$f":"EHPAD!C18","v":0}]
["Le responsable des services administratifs"]
["Le responsable de la logistique",{"$f":"EHPAD!B22","v":0},null,null,{"$f":"EHPAD!C22","v":0}]
["L'IDEC ou cadre de santé",{"$f":"EHPAD!B19","v":0},null,null,{"$f":"EHPAD!C19","v":0}]
["Le référent hygiène",{"$f":"EHPAD!B20","v":0},null,null,{"$f":"EHPAD!C20","v":0}]
["La secrétaire de direction"]
["L'IMH/EMH conventionné",{"$f":"EHPAD!B24","v":0},null,null,{"$f":"EHPAD!C24","v":0}]
["Médecin du travail",{"$f":"EHPAD!B23","v":0},null,null,{"$f":"EHPAD!C23","v":0}]
["…"]
["…"]
[]
[]
["Coordonnées personnelles : \nLes coordonnées téléphoniques personnelles des membres de la cellule de crise doivent figurer dans une enveloppe cachetée et mise à disposition au niveau du secrétariat ou du standard, la direction ne s’engageant à utiliser cette liste qu’en cas de situation exceptionnelle."]
[]
["3. Mission de la cellule de crise\n\nLe rôle des membres de la cellule sera adapté en fonction des situations. La cellule de crise est l’organe unique de décision et de coordination\n\nSes missions, en fonction de la nature et de l’ampleur de l’évènement, sont :\n• Estimer la gravité de la situation pour les résidents et le personnel\n• Mesurer les conséquences sur l’activité et sur l’organisation des soins\n• Centraliser les disponibilités des moyens et ressources dont dispose l’établissement\n• Evaluer les besoins et les moyens nécessaires,\n• Définir les actions de prévention nécessaires pour maitriser l’événement et éviter la crise \n• S’assurer de la mise en œuvre des actions\n• Assurer la transmission de l’information en interne et en externe\n• Gérer la communication autour de l’alerte ou de la crise\n• Rédiger une main courante sur les évènements et les actions mises en place\n• Organiser un retour d’expérience\n• Rédiger un rapport final une fois la situation d’alerte ou de crise terminée\n• Réaliser une rétro-information."]
[]
["4. Rôle des membres de la cellule de crise","Rôle",null,null,"Stock tampon nécessaire (autonomie 3 à 5 jours en cas d'épisode touchant 50% des résidents)\nà renseigner obligatoirement"]
["Directeur ou représentant","Pilotage de la gestion de l’événement et pouvoir décisionnaire",null,null,"Tabliers UU"]
[null,"Déclenchement de la crise, de son suivi et de sa levée.",null,null,"surblouses manches longues UU"]
[null,"Communication externe et interne",null,null,"Masques chirurgicaux"]
[null,"Coordination de la mise en œuvre des moyens logistiques",null,null,"Masques FFP2"]
[null,"Coordination de la cellule",null,null,"SHA"]
[null,"Bilan de la gestion de crise…",null,null,"Gants"]
["Médecin référent","Coordination médicale",null,null,"Eau de Javel"]
[null,"Lien avec les médecins traitants, les professionnels de santé et les établissements de soins",null,null,"…"]
[null,"Supervise la bonne application des procédures…."]
["Référent paramédical en hygiène","Coordination paramédicale",null,null,"Lieu de réunion de la cellule de crise"]
[null,"Transmissions au personnel",null,null,"Zone de cohorting pour les repas si plateaux en chambre impossible"]
[null,"S’assure de l’application des procédures"]
["Administratif","Tenir une main courante où seront consignés les évènements."]
[null,"Contribuer au rappel des personnels."]
[null,"Aide à la mise en œuvre des moyens logistiques"]
[]
["5. Signalement\n\nDans le cadre d’une alerte, et selon les modalités règlementaires (maladies à déclaration obligatoire, cas groupés d’IRAB, de GEA…), la cellule s’assure du signalement aux autorités sanitaires Agence Régionale de Santé. \nA ce titre, il est rappelé que tout évènement sanitaire inhabituel pouvant impacter sur la santé des résidents et des professionnels doit faire l’objet d’un signalement aux autorités sanitaires (Agence Régionale de Santé).\n\n6. Communication\n\nLa communication est un élément important. Elle est définie en cellule d’alerte ou de crise sous la responsabilité du directeur.\nAprès évaluation de la situation par la cellule, il est procédé, si nécessaire, à une information de l’ARS, de la préfecture, du SAMU, du Conseil Général, de la mairie, du personnel, des résidents, des familles, des médecins traitants, des intervenants. Si la crise est d’ampleur nationale, il convient de se référer aux éléments de communication élaborés par les autorités.\nLe cas échéant, la communication auprès des médias sera organisée. Des annuaires sont constitués à cet effet et intégrés au document plan bleu.\n\nLes principes de la communication sont de :\n• Anticiper et préparer la communication afin de conserver la maîtrise de l’information\n• Adapter son message au récepteur et à l’évènement\n• S’assurer de la cohérence et de la diffusion des messages délivrés par les différents acteurs\n• Etre vigilant sur l’impact psychologique de l’alerte ou de la crise sur les personnels de santé, résidents, familles…\n\nLes objectifs de la communication en situation d’alerte ou de crise sont d’informer rapidement, après vérification des données :\n• De la situation de manière factuelle\n• Des mesures mises en œuvre\n• Garantir l’information tout au long de l’évolution de la situation\n• Répondre aux interrogations légitimes des personnels soignants et non soignants de l’établissement, des intervenants extérieurs, des tutelles, des résidents et des familles\n• Convaincre que l’alerte ou la crise sont l’affaire de tous\n\nLimiter les dérives :\n• Secret professionnel\n• Respect de la confidentialité\n\nLes moyens : affiches, message vocal pré enregistré, message électronique, intranet, site web de l’établissement, numéro vert, article de presse, conférences, interview…\n"]
[]
["Dans le cadre d’une alerte, et selon les modalités règlementaires (maladies à déclaration obligatoire, cas groupés d’IRAB, de GEA…), la cellule s’assure du signalement aux autorités sanitaires Agence Régionale de Santé. \nA ce titre, il est rappelé que tout évènement sanitaire inhabituel pouvant impacter sur la santé des résidents et des professionnels doit faire l’objet d’un signalement aux autorités sanitaires (Agence Régionale de Santé).\n"]
[]
["6. Communication"]
[]
["La communication est un élément important. Elle est définie en cellule d’alerte ou de crise sous la responsabilité du directeur.\nAprès évaluation de la situation par la cellule, il est procédé, si nécessaire, à une information de l’ARS, de la préfecture, du SAMU, du Conseil Général, de la mairie, du personnel, des résidents, des familles, des médecins traitants, des intervenants. Si la crise est d’ampleur nationale, il convient de se référer aux éléments de communication élaborés par les autorités.\nLe cas échéant, la communication auprès des médias sera organisée. Des annuaires sont constitués à cet effet et intégrés au document plan bleu.\n\nLes principes de la communication sont de :\n• Anticiper et préparer la communication afin de conserver la maîtrise de l’information\n• Adapter son message au récepteur et à l’évènement\n• S’assurer de la cohérence et de la diffusion des messages délivrés par les différents acteurs\n• Etre vigilant sur l’impact psychologique de l’alerte ou de la crise sur les personnels de santé, résidents, familles…\n\nLes objectifs de la communication en situation d’alerte ou de crise sont d’informer rapidement, après vérification des données :\n• De la situation de manière factuelle\n• Des mesures mises en œuvre\n• Garantir l’information tout au long de l’évolution de la situation\n• Répondre aux interrogations légitimes des personnels soignants et non soignants de l’établissement, des intervenants extérieurs, des tutelles, des résidents et des familles\n• Convaincre que l’alerte ou la crise sont l’affaire de tous\n\nLimiter les dérives :\n• Secret professionnel\n• Respect de la confidentialité\n\nLes moyens : affiches, message vocal pré enregistré, message électronique, intranet, site web de l’établissement, numéro vert, article de presse, conférences, interview…\n"]

{"sheet":"GEA épid.","index":40,"n_rows":41,"n_cols":32,"rows_kept":41,"cut":false,"hidden":false,"merged":[[36,9,36,10],[36,21,36,22],[2,0,2,33],[3,0,3,33],[5,5,5,23],[6,5,6,23],[24,1,24,3],[32,0,32,31]]}
[]
[]
["Surveillance des gastro-entérites aigües "]
[" dans les collectivités de personnes âgées"]
[]
[null,null,null,"Etablissement :",null,{"$f":"Etablissement!E5","v":0}]
[null,null,null,"Mois/Année : "]
[null,"Mois :",null,null,null,null,null,"Année :"]
[]
[]
[]
[]
[]
[]
[]
[]
[]
[]
[]
[]
[]
[]
[]
[]
["Date du 1er jour :"]
[]
["Jour :",{"$f":"IF(B25=\"\",1,DAY(B30))","v":1},{"$f":"DAY(C30)","v":2},3,4,5,6,7,8,9,10,11,12,13,14,15,16,17,18,19,20,21,22,23,24,25,26,27,28,29,30,31]
["Cas résidents"]
["Cas professionnels"]
[null,{"$f":"IF(B25=\"\",\"01/01/2016\",B25)","v":"01/01/2016"},{"$f":"B30+1","v":"2016-01-02"},{"$f":"C30+1","v":"2016-01-03"},"2016-01-04","2016-01-05","2016-01-06","2016-01-07","2016-01-08","2016-01-09","2016-01-10","2016-01-11","2016-01-12","2016-01-13","2016-01-14","2016-01-15","2016-01-16","2016-01-17","2016-01-18","2016-01-19","2016-01-20","2016-01-21","2016-01-22","2016-01-23","2016-01-24","2016-01-25","2016-01-26","2016-01-27","2016-01-28","2016-01-29","2016-01-30","2016-01-31"]
["Chaque jour, noter uniquement les nouveaux cas"]
[]
["5 cas de GEA chez les résidents dans un délai de 4 jours = signalement externe"]
[]
[null,null,null,null,null,null,null,null,"Nombre total de résidents :",null,null,null,null,null,null,null,null,null,null,null,"Nbre total de professionnels :"]
[]
[null,null,null,null,null,null,null,null,"Taux d'attaque chez les résidents : ",{"$f":"IF(J35=\"\",\"\",SUM(B28:AF28)/J35*100)","v":""},null,"%",null,null,null,null,null,null,null,null,"Taux d'attaque chez les professionnels :",{"$f":"IF(V35=\"\",\"\",SUM(B29:AF29)/V35*100)","v":""},null,"%"]
[]
[]
[]
["Version : janvier 2016"]

{"sheet":"IRA épid.","index":41,"n_rows":41,"n_cols":32,"rows_kept":41,"cut":false,"hidden":false,"merged":[[36,9,36,10],[36,21,36,22],[2,0,2,33],[3,0,3,33],[5,5,5,23],[6,5,6,23],[24,1,24,3],[32,0,32,31]]}
[]
[]
["Surveillance des infections respiratoires aigües "]
[" dans les collectivités de personnes âgées"]
[]
[null,null,null,"Etablissement :",null,{"$f":"Etablissement!E5","v":0}]
[null,null,null,"Mois/Année : "]
[null,"Mois :",null,null,null,null,null,"Année :"]
[]
[]
[]
[]
[]
[]
[]
[]
[]
[]
[]
[]
[]
[]
[]
[]
["Date du 1er jour :"]
[]
["Jour :",{"$f":"IF(B25=\"\",1,DAY(B30))","v":1},{"$f":"DAY(C30)","v":2},3,4,5,6,7,8,9,10,11,12,13,14,15,16,17,18,19,20,21,22,23,24,25,26,27,28,29,30,31]
["Cas résidents"]
["Cas professionnels"]
[null,{"$f":"IF(B25=\"\",\"01/01/2016\",B25)","v":"01/01/2016"},{"$f":"B30+1","v":"2016-01-02"},{"$f":"C30+1","v":"2016-01-03"},"2016-01-04","2016-01-05","2016-01-06","2016-01-07","2016-01-08","2016-01-09","2016-01-10","2016-01-11","2016-01-12","2016-01-13","2016-01-14","2016-01-15","2016-01-16","2016-01-17","2016-01-18","2016-01-19","2016-01-20","2016-01-21","2016-01-22","2016-01-23","2016-01-24","2016-01-25","2016-01-26","2016-01-27","2016-01-28","2016-01-29","2016-01-30","2016-01-31"]
["Chaque jour, noter uniquement les nouveaux cas"]
[]
["5 cas d'IRA chez les résidents dans un délai de 4 jours (en dehors des pneumopathies de déglutition) = signalement externe"]
[]
[null,null,null,null,null,null,null,null,"Nombre total de résidents :",null,null,null,null,null,null,null,null,null,null,null,"Nbre total de professionnels :"]
[]
[null,null,null,null,null,null,null,null,"Taux d'attaque chez les résidents : ",{"$f":"IF(J35=\"\",\"\",SUM(B28:AF28)/J35*100)","v":""},null,"%",null,null,null,null,null,null,null,null,"Taux d'attaque chez les professionnels :",{"$f":"IF(V35=\"\",\"\",SUM(B29:AF29)/V35*100)","v":""},null,"%"]
[]
[]
["Source : Conduite à tenir devant une ou plusieurs infections respiratoires aiguës dans les collectivités de personnes âgées, HCSP, juillet 2012"]
["Version : janvier 2016"]

{"sheet":"Chapitre VII","index":42,"n_rows":56,"n_cols":2,"rows_kept":56,"cut":false,"hidden":false,"merged":[[0,0,0,2],[1,0,1,2]]}
["CHAPITRE VII"]
["PREVENTION DES ACCIDENTS AVEC EXPOSITION AU SANG"]
[]
[]
[]
["Rappel: ","les données sont à saisir dans les cellules vert pâle. Saisie obligatoire pour tous les critères proposés."]
[null,"Pour certaines questions, lorsqu'une réponse négative est donnée, les questions suivantes apparaissent en gris:"]
[null,"vous n'avez pas à y répondre."]
[]
[null,"Tout le personnel est à jour de la vaccination pour le VHB ou est protégé par auto-immunisation (sous la responsabilité: Directeur, médecin du travail)"]
[null,"1=Oui, 2=Non"]
[null,"Une formation auprès de tout le personnel, y compris les intervenants extérieurs, pour prévenir les risques d'AES a été organisée dans l'établissement"]
[null,"1=Oui, 2=Non"]
[null,"Il existe des procédures institutionnelles détaillant la conduite à tenir (CAT) en cas d'AES mise en oeuvre dans l'établissement"]
[null,"1=Oui, 2=Non"]
[null,"Si oui, elles sont:"]
[null,"     - validées par le médecin coordonnateur ou le directeur ou par l'instance de prévention des infections"]
[null,"1=Oui, 2=Non"]
[null,"     - diffusées et mises à disposition dans tous les secteurs de l'EHPAD"]
[null,"1=Oui, 2=Non"]
[null,"La CAT est affichée dans tous les lieux communs du personnel et des intervenants"]
[null,"1=Oui, 2=Non"]
[null,"En cas d'AES, il est prévu de faire un test rapide VIH pour investiguer le patient source (lorque celui-ci est connu et avec son accord ou avec l'accord de la personne de confiance ou du référent familial)"]
[null,"1=Oui, 2=Non"]
[null,"Il existe un suivi épidémiologique des AES dans l'établissement réalisé par le médecin du travail"]
[null,"1=Oui, 2=Non"]
[null,"Donner la tendance évolutive du nombre d'AES de l'EHPAD au cours des 3 dernières années (médecin du travail)"]
[null,"1=En augmentation, 2=En diminution, 3=Stable, 4=Ne sait pas"]
[null,"Si votre EHPAD est doté d'un CHSCT, le bilan annuel des AES est présenté lors d'une réunion"]
[null,"1=Oui, 2=Non, 3=NA"]
[]
[null,"Le personnel dispose des équipements et du matériel de protection suivants:"]
[null,"     - des gants à usage unique non stériles"]
[null,"1=Oui, 2=Non"]
[null,"     - des masques chirurgicaux"]
[null,"1=Oui, 2=Non"]
[null,"     - des lunettes de protection"]
[null,"1=Oui, 2=Non"]
[]
[null,"Le personnel dispose des équipements ou du matériel de sécurité suivants:"]
[null,"     - des collecteurs OPCT munis de système de fixation"]
[null,"1=Oui, 2=Non"]
[null,"     - du matériel sécurisé pour prélèvements sanguins"]
[null,"1=Oui, 2=Non, 3=NA"]
[null,"     - du matériel sécurisé pour prélèvements capillaires"]
[null,"1=Oui, 2=Non, 3=NA"]
[null,"     - du matériel sécurisé pour injections"]
[null,"1=Oui, 2=Non, 3=NA"]
[null,"     - du matériel sécurisé pour perfusions veineuses"]
[null,"1=Oui, 2=Non, 3=NA"]
[null,"     - du matériel sécurisé pour perfusions sous cutanées"]
[null,"1=Oui, 2=Non, 3=NA"]
[null,"     - du matériel sécurisé pour l'insulinothérapie par auto-piqueur"]
[null,"1=Oui, 2=Non, 3=NA"]
[]
[null,"MENU"]

{"sheet":"Eval 7","index":43,"n_rows":11,"n_cols":17,"rows_kept":11,"cut":false,"hidden":false,"merged":[[10,8,10,15],[2,0,2,1],[3,0,7,0],[0,2,0,3]]}
[null,"Renseigner les cases bleu pâle:",null,null,null,"Renseigner obligatoirement"]
[]
["Prévention des AES",null,"Fréquence","Gravité","Risque  ","Actions Proposées en comité de pilotage","Validation",null,"Suivi autoévaluation GREPHH\n(à renseigner obligatoirement)",{"$f":"EHPAD!B7","v":2018},{"$f":"J3+1","v":2019},{"$f":"K3+1","v":2020},2021,2022,2023,2024,2025]
["AES","Risque AES (suivi annuel)",1,4,{"$f":"IF(OR(AND(C4<=3,D4=1),AND(C4=1,D4=2),AND(C4=1,D4=3)),\"Risque faible\",IF(OR(AND(C4=4,D4=1),AND(C4=3,D4=2),AND(C4=2,D4=2),AND(C4=2,D4=3),AND(C4=1,D4=4)),\"Risque moyen\",IF(OR(AND(C4=4,D4=2),AND(C4=3,D4=3),AND(C4=4,D4=3),AND(C4=2,D4=4),AND(C4=3,D4=4),AND(C4=4,D4=4)),\"Risque élevé\",\" \")))","v":"Risque moyen"},"Evaluer les circonstances des AES pour adapter le plan d'actions",null,null,"Autoévaluation du GREPHH Prévention AES "]
[null,"Collecteurs piquants/coupants trop remplis, non utilisation de la fermeture provisoire (audit déchets)",1,3,{"$f":"IF(OR(AND(C5<=3,D5=1),AND(C5=1,D5=2),AND(C5=1,D5=3)),\"Risque faible\",IF(OR(AND(C5=4,D5=1),AND(C5=3,D5=2),AND(C5=2,D5=2),AND(C5=2,D5=3),AND(C5=1,D5=4)),\"Risque moyen\",IF(OR(AND(C5=4,D5=2),AND(C5=3,D5=3),AND(C5=4,D5=3),AND(C5=2,D5=4),AND(C5=3,D5=4),AND(C5=4,D5=4)),\"Risque élevé\",\" \")))","v":"Risque faible"},"Texte libre AES 0"]
[null,"Mauvaise compliance des IDE aux gants en cas de geste invasif",1,3,"Risque faible","Prévoir des gants en nitrile pour les gestes à risque de piqûre",null,null,null,{"$f":"J3","v":2018},{"$f":"J6+1","v":2019},{"$f":"K6+1","v":2020},2021,2022,2023,2024,2025]
[null,"Texte libre AES 1",1,3,"Risque faible","Texte libre AES 1",null,null,"Suivi annuel des AES \n(à renseigner obligatoirement)"]
[null,"Texte libre AES 2",1,3,"Risque faible","Texte libre AES 2",null,null,"Nombre soignants formés AES / 5 dernières années"]
[null,null,null,null,null,null,null,null,"Taux soignants formés AES / 5 dernières années",{"$f":"J8/EHPAD!B14","v":{"$error":"#DIV/0!"}},{"$f":"K8/EHPAD!C14","v":{"$error":"#DIV/0!"}},{"$f":"L8/EHPAD!D14","v":{"$error":"#DIV/0!"}},{"$f":"M8/EHPAD!E14","v":{"$error":"#DIV/0!"}},{"$f":"N8/EHPAD!F14","v":{"$error":"#DIV/0!"}},{"$f":"O8/EHPAD!G14","v":{"$error":"#DIV/0!"}},{"$f":"P8/EHPAD!H14","v":{"$error":"#DIV/0!"}},{"$f":"Q8/EHPAD!I14","v":{"$error":"#DIV/0!"}}]
[null,null,null,null,null,null,null,null,"Nom ou codification des éléments de preuve*"]
[null,null,null,null,null,null,null,null,"* élément de preuve = attestations de formation et feuille de présence"]

{"sheet":"PLAN d'ACTION","index":44,"n_rows":455,"n_cols":24,"rows_kept":455,"cut":false,"hidden":false,"merged":[[1,0,2,2],[1,3,2,7],[0,9,0,11],[0,13,0,16],[0,0,0,7],[72,1,98,1],[72,0,215,0],[452,3,453,5],[3,23,4,23],[344,22,345,22],[344,3,344,5],[344,6,345,6],[344,7,345,7],[344,8,344,11],[344,12,345,12],[344,13,344,16],[360,2,361,2],[360,3,360,5],[360,6,361,6],[216,22,217,22],[362,0,424,0],[418,1,424,1],[407,1,417,1],[344,2,345,2],[346,1,359,1],[346,0,359,0],[375,1,390,1],[391,1,406,1],[360,0,361,0],[360,1,361,1],[362,1,374,1],[344,0,345,0],[344,1,345,1],[425,22,426,22],[427,0,451,0],[425,7,426,7],[425,8,425,11],[425,12,426,12],[425,13,425,16],[425,17,426,17],[425,18,425,21],[425,0,426,0],[425,1,426,1],[425,2,426,2],[425,3,425,5],[425,6,426,6],[427,1,451,1],[360,22,361,22],[360,7,361,7],[360,8,360,11],[360,12,361,12],[360,13,360,16],[360,17,361,17],[360,18,360,21],[261,22,262,22],[261,7,262,7],[261,8,261,11],[261,12,262,12],[261,13,261,16],[261,17,262,17],[261,18,261,21],[344,17,345,17],[344,18,344,21],[99,1,122,1],[150,1,171,1],[123,1,149,1],[3,0,4,0],[216,3,216,5],[216,6,217,6],[70,3,70,5],[70,0,71,0],[70,1,71,1],[5,0,69,0],[5,1,22,1],[53,1,69,1],[23,1,42,1],[43,1,52,1],[216,0,217,0],[216,1,217,1],[218,0,260,0],[303,1,313,1],[314,1,328,1],[329,1,338,1],[339,1,343,1],[218,1,260,1],[263,0,343,0],[263,1,302,1],[172,1,215,1],[261,0,262,0],[261,1,262,1],[261,3,261,5],[261,6,262,6],[216,18,216,21],[3,3,3,5],[70,18,70,21],[70,2,71,2],[261,2,262,2],[216,7,217,7],[216,8,216,11],[216,12,217,12],[216,13,216,16],[216,17,217,17],[216,2,217,2],[3,22,4,22],[3,7,4,7],[3,8,3,11],[3,12,4,12],[3,13,3,16],[3,1,4,1],[70,22,71,22],[70,8,70,11],[70,12,71,12],[70,13,70,16],[70,17,71,17],[70,6,71,6],[70,7,71,7],[3,17,4,17],[3,18,3,21],[3,6,4,6]]}
["Pour valider le DARI à partir du plan d'action : \n1 - soit cliquer sur \"ACTUALISER\" soit Cliquer sur 'FILTRE' et 'selectionner tout' puis Supprimer les coches de priorisation qui sont en rapport avec un axe d'amélioration vide, puis Cliquer sur 'FILTRE' et déselectionner '(Vides)'\n2 - Définir le degré de priorité des Actions en mettant un lettre ou un chiffre dans les cases des colonnes H M et F (priorité haute, moyenne ou faible)\n3 - indiquer la personne en charge de l'action\n4- Définir une échéance\n5- Indiquer l'année en cours dans la case bleue pâle",null,null,null,null,null,null,null,null,"Action réalisée: surligner la ligne correspondante",null,null,null,"Action en cours: surligner la ligne correspondante"]
["PLAN D'ACTION DE MAITRISE DU RISQUE INFECTIEUX DE  L'ETABLISSEMENT:",null,null,{"$f":"Etablissement!E5","v":0}]
[]
["Chapitre","Thèmes","Axes d'amélioration","Priorité\nOblligatoire",null,null,"Responsable","Moyens",2021,null,null,null,"Objectif atteint O/N/EC",{"$f":"I4+1","v":2022},null,null,null,"Objectif atteint O/N/EC",{"$f":"N4+1","v":2023},null,null,null,"Objectif atteint O/N/EC","Filtre"]
[null,null,"FILTRE","H","M","F",null,null,"1er ","2eme","3eme","4eme",null,"1er","2eme","3eme","4eme",null,"1er","2eme","3eme","4eme"]
["1-    organisation des moyens de prévention","Moyens ",{"$f":"IF(NOT('Chapitre I'!$C$11=1),'PAQ type GREPHH'!$C$3,\"\")","v":"Embaucher un médecin coordonnateur"},null,null,null,null,2019,null,null,null,null,null,null,null,null,null,null,null,null,null,null,null,{"$f":"IF(OR(NOT(C6=\"\"),NOT(D6=\"\"),NOT(E6=\"\"),NOT(F6=\"\")),1,0)","v":1}]
[null,null,{"$f":"IF(NOT('Chapitre I'!$C$14=1),'PAQ type GREPHH'!$C$4,\"\")","v":"Passer une convention avec un établissement de santé"},null,null,null,null,null,null,null,null,null,null,null,null,null,null,null,null,null,null,null,null,{"$f":"IF(OR(NOT(C7=\"\"),NOT(D7=\"\"),NOT(E7=\"\"),NOT(F7=\"\")),1,0)","v":1}]
[null,null,{"$f":"IF(NOT('Chapitre I'!$C$16=1),'PAQ type GREPHH'!$C$5,\"\")","v":"Passer une convention avec une EOH/EMH/IMH"},null,null,null,null,null,null,null,null,null,null,null,null,null,null,null,null,null,null,null,null,1]
[null,null,{"$f":"IF(NOT('Chapitre I'!$C$20=1),'PAQ type GREPHH'!$C$6,\"\")","v":"Nommer un référent en  hygiène avec un temps dédié, et bien définir son rôle dans la structure\nInscrire le réferent à la formation Hygiène EOH/EMH/IMH"},null,null,null,null,null,null,null,null,null,null,null,null,null,null,null,null,null,null,null,null,1]
[null,null,{"$f":"IF(NOT('Chapitre I'!$C$22=1),'PAQ type GREPHH'!$C$7,\"\")","v":"Intégrer le risque hygiène dans le rapport d'activité  du risque infectieux (cf onglet outils 1)"},null,null,null,null,null,null,null,null,null,null,null,null,null,null,null,null,null,null,null,null,1]
[null,null,{"$f":"IF(NOT('Chapitre I'!$C$24=1),'PAQ type GREPHH'!$C$8,\"\")","v":"Organiser La formation du personnel à la prévention des IAS"},null,null,null,null,null,null,null,null,null,null,null,null,null,null,null,null,null,null,null,null,1]
[null,null,{"$f":"IF(AND('Chapitre I'!$C$24=1,NOT('Chapitre I'!$C$27=1)),'PAQ type GREPHH'!$C$9,\"\")","v":""},null,null,null,null,null,null,null,null,null,null,null,null,null,null,null,null,null,null,null,null,0]
[null,null,{"$f":"IF(AND('Chapitre I'!$C$24=1,NOT('Chapitre I'!$C$29=1)),'PAQ type GREPHH'!$C$10,\"\")","v":""},null,null,null,null,null,null,null,null,null,null,null,null,null,null,null,null,null,null,null,null,0]
[null,null,{"$f":"IF(AND('Chapitre I'!$C$24=1,NOT('Chapitre I'!$C$31=1)),'PAQ type GREPHH'!$C$11,\"\")","v":""},null,null,null,null,null,null,null,null,null,null,null,null,null,null,null,null,null,null,null,null,0]
[null,null,{"$f":"IF(AND('Chapitre I'!$C$24=1,NOT('Chapitre I'!$C$33=1)),'PAQ type GREPHH'!$C$12,\"\")","v":""},null,null,null,null,null,null,null,null,null,null,null,null,null,null,null,null,null,null,null,null,0]
[null,null,{"$f":"IF(AND('Chapitre I'!$C$24=1,NOT('Chapitre I'!$C$35=1)),'PAQ type GREPHH'!$C$13,\"\")","v":""},null,null,null,null,null,null,null,null,null,null,null,null,null,null,null,null,null,null,null,null,0]
[null,null,{"$f":"IF(NOT('Eval 1'!G4=\"\"),'Eval 1'!F4,\"\")","v":""},null,null,null,null,null,null,null,null,null,null,null,null,null,null,null,null,null,null,null,null,0]
[null,null,{"$f":"IF(NOT('Eval 1'!G5=\"\"),'Eval 1'!F5,\"\")","v":""},null,null,null,null,null,null,null,null,null,null,null,null,null,null,null,null,null,null,null,null,0]
[null,null,{"$f":"IF(NOT('Eval 1'!G6=\"\"),'Eval 1'!F6,\"\")","v":""},null,null,null,null,null,null,null,null,null,null,null,null,null,null,null,null,null,null,null,null,0]
[null,null,{"$f":"IF(NOT('Eval 1'!G7=\"\"),'Eval 1'!F7,\"\")","v":""},null,null,null,null,null,null,null,null,null,null,null,null,null,null,null,null,null,null,null,null,0]
[null,null,{"$f":"IF(NOT('Eval 1'!G8=\"\"),'Eval 1'!F8,\"\")","v":""},null,null,null,null,null,null,null,null,null,null,null,null,null,null,null,null,null,null,null,null,0]
[null,null,{"$f":"IF(NOT('Eval 1'!G9=\"\"),'Eval 1'!F9,\"\")","v":""},null,null,null,null,null,null,null,null,null,null,null,null,null,null,null,null,null,null,null,null,0]
[null,null,{"$f":"IF(NOT('Eval 1'!G10=\"\"),'Eval 1'!F10,\"\")","v":""},null,null,null,null,null,null,null,null,null,null,null,null,null,null,null,null,null,null,null,null,0]
[null,"Surveillance Alerte Indicateurs",{"$f":"IF(NOT('Chapitre I'!$C$40=1),'PAQ type GREPHH'!$C$14,\"\")","v":"Réaliser une enquête de prévalence des IAS en EHPAD (Prev'EHPAD) en mai ou juin"},null,null,null,null,null,null,null,null,null,null,null,null,null,null,null,null,null,null,null,null,1]
[null,null,{"$f":"IF(NOT('Chapitre I'!$C$44=1),'PAQ type GREPHH'!$C$15,\"\")","v":"Définir une politique de prise en charge des résidents porteurs de BMR avec signalement interne "},null,null,null,null,null,null,null,null,null,null,null,null,null,null,null,null,null,null,null,null,1]
[null,null,{"$f":"IF(NOT('Chapitre I'!C46=1),'PAQ type GREPHH'!$C$16,\"\")","v":"Réaliser un suivi épidémiologique du nombre de résidents porteurs de BMR/BHRe dans la structure"},null,null,null,null,null,null,null,null,null,null,null,null,null,null,null,null,null,null,null,null,1]
[null,null,{"$f":"IF(NOT('Chapitre I'!$C$48=1),'PAQ type GREPHH'!$C$17,\"\")","v":"Organiser une évaluation nutritionnelle des résidents dans la structure"},null,null,null,null,null,null,null,null,null,null,null,null,null,null,null,null,null,null,null,null,1]
[null,null,{"$f":"IF(NOT('Chapitre I'!$C$50=1),'PAQ type GREPHH'!$C$18,\"\")","v":"Rédiger une CAT en cas de malnutrition ou déshydratation"},null,null,null,null,null,null,null,null,null,null,null,null,null,null,null,null,null,null,null,null,1]
[null,null,{"$f":"IF(NOT('Chapitre I'!$C$52=1),'PAQ type GREPHH'!$C$19,\"\")","v":"Organiser le suivi du poids des résidents de façon mensuelle"},null,null,null,null,null,null,null,null,null,null,null,null,null,null,null,null,null,null,null,null,1]
[null,null,{"$f":"IF(NOT('Chapitre I'!$C$54=1),'PAQ type GREPHH'!$C$20,\"\")","v":"Identifier les personnes ressources ARS, CIRE, CLAT, CCLIN et ARLIN (cf. onglet Plan de maitrise épidémie)"},null,null,null,null,null,null,null,null,null,null,null,null,null,null,null,null,null,null,null,null,1]
[null,null,{"$f":"IF(AND('Chapitre I'!$C$54=1,NOT('Chapitre I'!$C$56=1)),'PAQ type GREPHH'!$C$21,\"\")","v":""},null,null,null,null,null,null,null,null,null,null,null,null,null,null,null,null,null,null,null,null,0]
[null,null,{"$f":"IF(AND('Chapitre I'!$C$54=1,NOT('Chapitre I'!$C$58=1)),'PAQ type GREPHH'!$C$22,\"\")","v":""},null,null,null,null,null,null,null,null,null,null,null,null,null,null,null,null,null,null,null,null,0]
[null,null,{"$f":"IF(AND('Chapitre I'!$C$54=1,NOT('Chapitre I'!$C$60=1)),'PAQ type GREPHH'!$C$23,\"\")","v":""},null,null,null,null,null,null,null,null,null,null,null,null,null,null,null,null,null,null,null,null,0]
[null,null,{"$f":"IF(AND('Chapitre I'!$C$54=1,NOT('Chapitre I'!$C$62=1)),'PAQ type GREPHH'!$C$24,\"\")","v":""},null,null,null,null,null,null,null,null,null,null,null,null,null,null,null,null,null,null,null,null,0]
[null,null,{"$f":"IF(NOT('Eval 1'!G11=\"\"),'Eval 1'!F11,\"\")","v":""},null,null,null,null,null,null,null,null,null,null,null,null,null,null,null,null,null,null,null,null,0]
[null,null,{"$f":"IF(NOT('Eval 1'!G12=\"\"),'Eval 1'!F12,\"\")","v":""},null,null,null,null,null,null,null,null,null,null,null,null,null,null,null,null,null,null,null,null,0]
[null,null,{"$f":"IF(NOT('Eval 1'!G13=\"\"),'Eval 1'!F13,\"\")","v":""},null,null,null,null,null,null,null,null,null,null,null,null,null,null,null,null,null,null,null,null,0]
[null,null,{"$f":"IF(NOT('Eval 1'!G14=\"\"),'Eval 1'!F14,\"\")","v":""},null,null,null,null,null,null,null,null,null,null,null,null,null,null,null,null,null,null,null,null,0]
[null,null,{"$f":"IF(NOT('Eval 1'!G15=\"\"),'Eval 1'!F15,\"\")","v":""},null,null,null,null,null,null,null,null,null,null,null,null,null,null,null,null,null,null,null,null,0]
[null,null,{"$f":"IF(NOT('Eval 1'!G16=\"\"),'Eval 1'!F16,\"\")","v":""},null,null,null,null,null,null,null,null,null,null,null,null,null,null,null,null,null,null,null,null,0]
[null,null,{"$f":"IF(NOT('Eval 1'!G17=\"\"),'Eval 1'!F17,\"\")","v":""},null,null,null,null,null,null,null,null,null,null,null,null,null,null,null,null,null,null,null,null,0]
[null,null,{"$f":"IF(NOT('Eval 1'!G18=\"\"),'Eval 1'!F18,\"\")","v":""},null,null,null,null,null,null,null,null,null,null,null,null,null,null,null,null,null,null,null,null,0]
[null,null,{"$f":"IF(NOT('Eval 1'!G19=\"\"),'Eval 1'!F19,\"\")","v":""},null,null,null,null,null,null,null,null,null,null,null,null,null,null,null,null,null,null,null,null,0]
[null,"Antibiotiques ",{"$f":"IF(NOT('Chapitre I'!$C$67=1),'PAQ type GREPHH'!$C$26,\"\")","v":"Définir la politique antibiotique"},null,null,null,null,null,null,null,null,null,null,null,null,null,null,null,null,null,null,null,null,1]
[null,null,{"$f":"IF(AND('Chapitre I'!$C$67=1,NOT('Chapitre I'!$C$70=1)),'PAQ type GREPHH'!$C$28,\"\")","v":""},null,null,null,null,null,null,null,null,null,null,null,null,null,null,null,null,null,null,null,null,0]
[null,null,{"$f":"IF(AND('Chapitre I'!$C$67=1,NOT('Chapitre I'!$C$72=1)),'PAQ type GREPHH'!$C$27,\"\")","v":""},null,null,null,null,null,null,null,null,null,null,null,null,null,null,null,null,null,null,null,null,0]
[null,null,{"$f":"IF(NOT('Chapitre I'!$C$74=1),'PAQ type GREPHH'!$C$29,\"\")","v":"Organiser la réévaluation des ATB à 48-72h"},null,null,null,null,null,null,null,null,null,null,null,null,null,null,null,null,null,null,null,null,1]
[null,null,{"$f":"IF(NOT('Eval 1'!G20=\"\"),'Eval 1'!F20,\"\")","v":""},null,null,null,null,null,null,null,null,null,null,null,null,null,null,null,null,null,null,null,null,0]
[null,null,{"$f":"IF(NOT('Eval 1'!G21=\"\"),'Eval 1'!F21,\"\")","v":""},null,null,null,null,null,null,null,null,null,null,null,null,null,null,null,null,null,null,null,null,0]
[null,null,{"$f":"IF(NOT('Eval 1'!G22=\"\"),'Eval 1'!F22,\"\")","v":""},null,null,null,null,null,null,null,null,null,null,null,null,null,null,null,null,null,null,null,null,0]
[null,null,{"$f":"IF(NOT('Eval 1'!G23=\"\"),'Eval 1'!F23,\"\")","v":""},null,null,null,null,null,null,null,null,null,null,null,null,null,null,null,null,null,null,null,null,0]
[null,null,{"$f":"IF(NOT('Eval 1'!G24=\"\"),'Eval 1'!F24,\"\")","v":""},null,null,null,null,null,null,null,null,null,null,null,null,null,null,null,null,null,null,null,null,0]
[null,null,{"$f":"IF(NOT('Eval 1'!G25=\"\"),'Eval 1'!F25,\"\")","v":""},null,null,null,null,null,null,null,null,null,null,null,null,null,null,null,null,null,null,null,null,0]
[null,"Tenue                                       ",{"$f":"IF(NOT('Chapitre I'!$C$79=1),'PAQ type GREPHH'!$C$30,\"\")","v":"Mettre en place un règlement intérieur prenant en compte les items sur l'hygiène de la tenue: changement quotidien , absence de vêtement dépassant de la tenue , cheveux attachés, absence de bijoux, ongles courts et sans vernis ni faux ongles"},null,null,null,null,null,null,null,null,null,null,null,null,null,null,null,null,null,null,null,null,1]
[null,null,{"$f":"IF(AND('Chapitre I'!$C$79=1,NOT('Chapitre I'!$C$82=1)),'PAQ type GREPHH'!$C$31,\"\")","v":""},null,null,null,null,null,null,null,null,null,null,null,null,null,null,null,null,null,null,null,null,0]
[null,null,{"$f":"IF(AND('Chapitre I'!$C$79=1,NOT('Chapitre I'!$C$84=1)),'PAQ type GREPHH'!$C$32,\"\")","v":""},null,null,null,null,null,null,null,null,null,null,null,null,null,null,null,null,null,null,null,null,0]
[null,null,{"$f":"IF(AND('Chapitre I'!$C$79=1,NOT('Chapitre I'!$C$86=1)),'PAQ type GREPHH'!$C$33,\"\")","v":""},null,null,null,null,null,null,null,null,null,null,null,null,null,null,null,null,null,null,null,null,0]
[null,null,{"$f":"IF(AND('Chapitre I'!$C$79=1,NOT('Chapitre I'!$C$88=1)),'PAQ type GREPHH'!$C$34,\"\")","v":""},null,null,null,null,null,null,null,null,null,null,null,null,null,null,null,null,null,null,null,null,0]
[null,null,{"$f":"IF(AND('Chapitre I'!$C$79=1,NOT('Chapitre I'!$C$90=1)),'PAQ type GREPHH'!$C$35,\"\")","v":""},null,null,null,null,null,null,null,null,null,null,null,null,null,null,null,null,null,null,null,null,0]
[null,null,{"$f":"IF(AND('Chapitre I'!$C$79=1,NOT('Chapitre I'!$C$92=1)),'PAQ type GREPHH'!$C$36,\"\")","v":""},null,null,null,null,null,null,null,null,null,null,null,null,null,null,null,null,null,null,null,null,0]
[null,null,{"$f":"IF(AND('Chapitre I'!$C$79=1,NOT('Chapitre I'!$C$94=1)),'PAQ type GREPHH'!$C$37,\"\")","v":""},null,null,null,null,null,null,null,null,null,null,null,null,null,null,null,null,null,null,null,null,0]
[null,null,{"$f":"IF(AND('Chapitre I'!$C$79=1,NOT('Chapitre I'!$C$96=1)),'PAQ type GREPHH'!$C$38,\"\")","v":""},null,null,null,null,null,null,null,null,null,null,null,null,null,null,null,null,null,null,null,null,0]
[null,null,{"$f":"IF(AND('Chapitre I'!$C$79=1,NOT('Chapitre I'!$C$98=1)),'PAQ type GREPHH'!$C$39,\"\")","v":""},null,null,null,null,null,null,null,null,null,null,null,null,null,null,null,null,null,null,null,null,0]
[null,null,{"$f":"IF(AND('Chapitre I'!$C$79=1,NOT('Chapitre I'!$C$100=1)),'PAQ type GREPHH'!$C$40,\"\")","v":""},null,null,null,null,null,null,null,null,null,null,null,null,null,null,null,null,null,null,null,null,0]
[null,null,{"$f":"IF(AND('Chapitre I'!$C$79=1,NOT('Chapitre I'!$C$102=1)),'PAQ type GREPHH'!$C$41,\"\")","v":""},null,null,null,null,null,null,null,null,null,null,null,null,null,null,null,null,null,null,null,null,0]
[null,null,{"$f":"IF(NOT('Eval 1'!G26=\"\"),'Eval 1'!F26,\"\")","v":""},null,null,null,null,null,null,null,null,null,null,null,null,null,null,null,null,null,null,null,null,0]
[null,null,{"$f":"IF(NOT('Eval 1'!G27=\"\"),'Eval 1'!F27,\"\")","v":""},null,null,null,null,null,null,null,null,null,null,null,null,null,null,null,null,null,null,null,null,0]
[null,null,{"$f":"IF(NOT('Eval 1'!G28=\"\"),'Eval 1'!F28,\"\")","v":""},null,null,null,null,null,null,null,null,null,null,null,null,null,null,null,null,null,null,null,null,0]
[null,null,{"$f":"IF(NOT('Eval 1'!G29=\"\"),'Eval 1'!F29,\"\")","v":""},null,null,null,null,null,null,null,null,null,null,null,null,null,null,null,null,null,null,null,null,0]
[null,null,{"$f":"IF(NOT('Eval 1'!G30=\"\"),'Eval 1'!F30,\"\")","v":""},null,null,null,null,null,null,null,null,null,null,null,null,null,null,null,null,null,null,null,null,0]
["Chapitre","Thèmes","Axes d'amélioration","Priorité",null,null,"Responsable","Moyens",{"$f":"I4","v":2021},null,null,null,"Objectif atteint O/N/EC",{"$f":"N4","v":2022},null,null,null,"Objectif atteint O/N/EC",{"$f":"S4","v":2023},null,null,null,"Objectif atteint O/N/EC",1]
[null,null,null,"H","M","F",null,null,"1er ","2eme","3eme","4eme",null,"1er","2eme","3eme","4eme",null,"1er","2eme","3eme","4eme",null,{"$f":"IF(OR(NOT(C72=\"\"),NOT(D72=\"\"),NOT(E72=\"\"),NOT(F72=\"\")),1,0)","v":1}]
["Gestion de l'environnement et des circuits","Entretien des locaux ",{"$f":"IF(NOT('Chapitre II'!$C$13=1),'PAQ type GREPHH'!$C$43,\"\")","v":"Rédiger valider et diffuser le protocole d'entretien des locaux"},null,null,null,null,null,null,null,null,null,null,null,null,null,null,null,null,null,null,null,null,{"$f":"IF(OR(NOT(C73=\"\"),NOT(D73=\"\"),NOT(E73=\"\"),NOT(F73=\"\")),1,0)","v":1}]
[null,null,{"$f":"IF(AND('Chapitre II'!$C$13=1,NOT('Chapitre II'!$C$16=1)),'PAQ type GREPHH'!$C$44,\"\")","v":""},null,null,null,null,null,null,null,null,null,null,null,null,null,null,null,null,null,null,null,null,0]
[null,null,{"$f":"IF(AND('Chapitre II'!$C$13=1,NOT('Chapitre II'!$C$18=1)),'PAQ type GREPHH'!$C$45,\"\")","v":""},null,null,null,null,null,null,null,null,null,null,null,null,null,null,null,null,null,null,null,null,0]
[null,null,{"$f":"IF(AND('Chapitre II'!$C$13=1,NOT('Chapitre II'!$C$20=1)),'PAQ type GREPHH'!$C$46,\"\")","v":""},null,null,null,null,null,null,null,null,null,null,null,null,null,null,null,null,null,null,null,null,0]
[null,null,{"$f":"IF(AND('Chapitre II'!$C$13=1,NOT('Chapitre II'!$C$23=1)),'PAQ type GREPHH'!$C$47,\"\")","v":""},null,null,null,null,null,null,null,null,null,null,null,null,null,null,null,null,null,null,null,null,0]
[null,null,{"$f":"IF(AND('Chapitre II'!$C$13=1,NOT('Chapitre II'!$C$25=1)),'PAQ type GREPHH'!$C$48,\"\")","v":""},null,null,null,null,null,null,null,null,null,null,null,null,null,null,null,null,null,null,null,null,0]
[null,null,{"$f":"IF(AND('Chapitre II'!$C$13=1,NOT('Chapitre II'!$C$27=1)),'PAQ type GREPHH'!$C$49,\"\")","v":""},null,null,null,null,null,null,null,null,null,null,null,null,null,null,null,null,null,null,null,null,0]
[null,null,{"$f":"IF(AND('Chapitre II'!$C$13=1,NOT('Chapitre II'!$C$29=1)),'PAQ type GREPHH'!$C$50,\"\")","v":""},null,null,null,null,null,null,null,null,null,null,null,null,null,null,null,null,null,null,null,null,0]
[null,null,{"$f":"IF(AND('Chapitre II'!$C$13=1,NOT('Chapitre II'!$C$31=1)),'PAQ type GREPHH'!$C$51,\"\")","v":""},null,null,null,null,null,null,null,null,null,null,null,null,null,null,null,null,null,null,null,null,0]
[null,null,{"$f":"IF(AND('Chapitre II'!$C$13=1,NOT('Chapitre II'!$C$33=1),NOT('Chapitre II'!$C$33=3)),'PAQ type GREPHH'!$C$52,\"\")","v":""},null,null,null,null,null,null,null,null,null,null,null,null,null,null,null,null,null,null,null,null,0]
[null,null,{"$f":"IF(AND('Chapitre II'!$C$13=1,NOT('Chapitre II'!$C$35=1)),'PAQ type GREPHH'!$C$53,\"\")","v":""},null,null,null,null,null,null,null,null,null,null,null,null,null,null,null,null,null,null,null,null,0]
[null,null,{"$f":"IF(AND('Chapitre II'!$C$13=1,NOT('Chapitre II'!$C$38=1)),'PAQ type GREPHH'!$C$54,\"\")","v":""},null,null,null,null,null,null,null,null,null,null,null,null,null,null,null,null,null,null,null,null,0]
[null,null,{"$f":"IF(AND('Chapitre II'!$C$13=1,NOT('Chapitre II'!$C$41=1)),'PAQ type GREPHH'!$C$55,\"\")","v":""},null,null,null,null,null,null,null,null,null,null,null,null,null,null,null,null,null,null,null,null,0]
[null,null,{"$f":"IF(AND('Chapitre II'!$C$13=1,NOT('Chapitre II'!$C$43=1)),'PAQ type GREPHH'!$C$56,\"\")","v":""},null,null,null,null,null,null,null,null,null,null,null,null,null,null,null,null,null,null,null,null,0]
[null,null,{"$f":"IF(AND('Chapitre II'!C13=1,NOT('Chapitre II'!C45=1)),'PAQ type GREPHH'!C57,\"\")","v":""},null,null,null,null,null,null,null,null,null,null,null,null,null,null,null,null,null,null,null,null,0]
[null,null,{"$f":"IF(AND('Chapitre II'!C13=1,NOT('Chapitre II'!C47=1)),'PAQ type GREPHH'!C58,\"\")","v":""},null,null,null,null,null,null,null,null,null,null,null,null,null,null,null,null,null,null,null,null,0]
[null,null,{"$f":"IF(NOT('Chapitre II'!C50=1),'PAQ type GREPHH'!C59,\"\")","v":"Mettre à disposition du personnel un chariot de ménage adapté"},null,null,null,null,null,null,null,null,null,null,null,null,null,null,null,null,null,null,null,null,1]
[null,null,{"$f":"IF(NOT('Chapitre II'!C53=1),'PAQ type GREPHH'!C60,\"\")","v":"Mettre à disposition du personnel des bandaux"},null,null,null,null,null,null,null,null,null,null,null,null,null,null,null,null,null,null,null,null,1]
[null,null,{"$f":"IF(NOT('Chapitre II'!C55=1),'PAQ type GREPHH'!C61,\"\")","v":"Mettre à disposition du personnel des balais trapèzes"},null,null,null,null,null,null,null,null,null,null,null,null,null,null,null,null,null,null,null,null,1]
[null,null,{"$f":"IF(NOT('Chapitre II'!C57=1),'PAQ type GREPHH'!C62,\"\")","v":"Mettre à disposition du personnel des lavettes"},null,null,null,null,null,null,null,null,null,null,null,null,null,null,null,null,null,null,null,null,1]
[null,null,{"$f":"IF(NOT('Chapitre II'!C59=1),'PAQ type GREPHH'!C63,\"\")","v":"Mettre à disposition du personnel les produits détergents et détergents / désinfectants"},null,null,null,null,null,null,null,null,null,null,null,null,null,null,null,null,null,null,null,null,1]
[null,null,{"$f":"IF(NOT('Eval 2'!G4=\"\"),'Eval 2'!F4,\"\")","v":""},null,null,null,null,null,null,null,null,null,null,null,null,null,null,null,null,null,null,null,null,0]
[null,null,{"$f":"IF(NOT('Eval 2'!G5=\"\"),'Eval 2'!F5,\"\")","v":""},null,null,null,null,null,null,null,null,null,null,null,null,null,null,null,null,null,null,null,null,0]
[null,null,{"$f":"IF(NOT('Eval 2'!G6=\"\"),'Eval 2'!F6,\"\")","v":""},null,null,null,null,null,null,null,null,null,null,null,null,null,null,null,null,null,null,null,null,0]
[null,null,{"$f":"IF(NOT('Eval 2'!G7=\"\"),'Eval 2'!F7,\"\")","v":""},null,null,null,null,null,null,null,null,null,null,null,null,null,null,null,null,null,null,null,null,0]
[null,null,{"$f":"IF(NOT('Eval 2'!G8=\"\"),'Eval 2'!F8,\"\")","v":""},null,null,null,null,null,null,null,null,null,null,null,null,null,null,null,null,null,null,null,null,0]
[null,null,{"$f":"IF(NOT('Eval 2'!G9=\"\"),'Eval 2'!F9,\"\")","v":""},null,null,null,null,null,null,null,null,null,null,null,null,null,null,null,null,null,null,null,null,0]
[null,"Hygiène en restauration",{"$f":"IF(NOT('Chapitre II'!C66=1),'PAQ type GREPHH'!C64,\"\")","v":"Mettre en place la méthode HACCP en restauration"},null,null,null,null,null,null,null,null,null,null,null,null,null,null,null,null,null,null,null,null,1]
[null,null,{"$f":"IF(AND('Chapitre II'!C68=1,NOT('Chapitre II'!C71=1)),'PAQ type GREPHH'!C65,\"\")","v":""},null,null,null,null,null,null,null,null,null,null,null,null,null,null,null,null,null,null,null,null,0]
[null,null,{"$f":"IF(AND('Chapitre II'!C68=1,NOT('Chapitre II'!C73=1)),'PAQ type GREPHH'!C66,\"\")","v":""},null,null,null,null,null,null,null,null,null,null,null,null,null,null,null,null,null,null,null,null,0]
[null,null,{"$f":"IF(AND('Chapitre II'!C68=2,NOT('Chapitre II'!C77=1)),'PAQ type GREPHH'!C67,\"\")","v":""},null,null,null,null,null,null,null,null,null,null,null,null,null,null,null,null,null,null,null,null,0]
[null,null,{"$f":"IF(AND('Chapitre II'!C68=2,NOT('Chapitre II'!C79=1)),'PAQ type GREPHH'!C68,\"\")","v":""},null,null,null,null,null,null,null,null,null,null,null,null,null,null,null,null,null,null,null,null,0]
[null,null,{"$f":"IF(AND('Chapitre II'!C68=2,NOT('Chapitre II'!C81=1)),'PAQ type GREPHH'!C69,\"\")","v":""},null,null,null,null,null,null,null,null,null,null,null,null,null,null,null,null,null,null,null,null,0]
[null,null,{"$f":"IF(NOT('Chapitre II'!C83=1),'PAQ type GREPHH'!C70,\"\")","v":"Mettre à la disposition des soignants un themomètre pour le repas "},null,null,null,null,null,null,null,null,null,null,null,null,null,null,null,null,null,null,null,null,1]
[null,null,{"$f":"IF(NOT('Chapitre II'!C85=1),'PAQ type GREPHH'!C71,\"\")","v":"Contrôler et tracer la température des réfrigérateurs"},null,null,null,null,null,null,null,null,null,null,null,null,null,null,null,null,null,null,null,null,1]
[null,null,{"$f":"IF(NOT('Chapitre II'!C87=1),'PAQ type GREPHH'!C72,\"\")","v":"Rédiger valider et diffuser la conduite à tenir en cas de températures non conformes des repas et réfrigérateurs"},null,null,null,null,null,null,null,null,null,null,null,null,null,null,null,null,null,null,null,null,1]
[null,null,{"$f":"IF(NOT('Chapitre II'!C89=1),'PAQ type GREPHH'!C73,\"\")","v":"Rédiger valider et diffuser le protocole concernant la distribution des repas en rajoutant l' hygiène des mains des agents et des résidents ainsi que la protection de la tenue pour le service"},null,null,null,null,null,null,null,null,null,null,null,null,null,null,null,null,null,null,null,null,1]
[null,null,{"$f":"IF(AND('Chapitre II'!C89=1,NOT('Chapitre II'!C93=1)),'PAQ type GREPHH'!C74,\"\")","v":""},null,null,null,null,null,null,null,null,null,null,null,null,null,null,null,null,null,null,null,null,0]
[null,null,{"$f":"IF(AND('Chapitre II'!C89=1,NOT('Chapitre II'!C95=1)),'PAQ type GREPHH'!C75,\"\")","v":""},null,null,null,null,null,null,null,null,null,null,null,null,null,null,null,null,null,null,null,null,0]
[null,null,{"$f":"IF(AND('Chapitre II'!C89=1,NOT('Chapitre II'!C97=1)),'PAQ type GREPHH'!C76,\"\")","v":""},null,null,null,null,null,null,null,null,null,null,null,null,null,null,null,null,null,null,null,null,0]
[null,null,{"$f":"IF(AND(NOT('Chapitre II'!C101=1),NOT('Chapitre II'!C101=3)),'PAQ type GREPHH'!C77,\"\")","v":"Rédiger, valider et diffuser le protocole d'entretien des chariots de distribution des repas et mettre en place une feuille de traçabilité"},null,null,null,null,null,null,null,null,null,null,null,null,null,null,null,null,null,null,null,null,1]
[null,null,{"$f":"IF(AND(NOT('Chapitre II'!C103=1),NOT('Chapitre II'!C103=3)),'PAQ type GREPHH'!C78,\"\")","v":"Rédiger, valider et diffuser le protocole d'entretien des réfrigirateurs"},null,null,null,null,null,null,null,null,null,null,null,null,null,null,null,null,null,null,null,null,1]
[null,null,{"$f":"IF(AND(NOT('Chapitre II'!C108=1),NOT('Chapitre II'!C108=3)),'PAQ type GREPHH'!C79,\"\")","v":"Rédiger, valider et diffuser le protocole d'entretien des micro ondes et mettre en place une feuille de traçabilité "},null,null,null,null,null,null,null,null,null,null,null,null,null,null,null,null,null,null,null,null,1]
[null,null,{"$f":"IF(AND(NOT('Chapitre II'!C113=1),NOT('Chapitre II'!C113=3)),'PAQ type GREPHH'!C80,\"\")","v":"Rédiger, valider et diffuser le protocole d'entretien des chauffe lait et mettre en place une feuille de traçabilité"},null,null,null,null,null,null,null,null,null,null,null,null,null,null,null,null,null,null,null,null,1]
[null,null,{"$f":"IF(AND(NOT('Chapitre II'!C118=1),NOT('Chapitre II'!C118=3)),'PAQ type GREPHH'!C81,\"\")","v":"Rédiger, valider et diffuser le protocole d'entretien des bouilloires et mettre en place une feuille de traçabilité"},null,null,null,null,null,null,null,null,null,null,null,null,null,null,null,null,null,null,null,null,1]
[null,null,{"$f":"IF(NOT('Chapitre II'!C123=1),'PAQ type GREPHH'!C82,\"\")","v":"Rédiger une conduite à tenir en cas de dysfonctionnement des appareils électroménagers (bouilloires, chauffes laits, micro-onde, réfrigérateurs, lave vaisselle…)"},null,null,null,null,null,null,null,null,null,null,null,null,null,null,null,null,null,null,null,null,1]
[null,null,{"$f":"IF(NOT('Chapitre II'!C127=1),'PAQ type GREPHH'!C83,\"\")","v":"Rédiger, valider et diffuser la procédure atelier cuisine le cas échéant"},null,null,null,null,null,null,null,null,null,null,null,null,null,null,null,null,null,null,null,null,1]
[null,null,{"$f":"IF(NOT('Eval 2'!G10=\"\"),'Eval 2'!F10,\"\")","v":""},null,null,null,null,null,null,null,null,null,null,null,null,null,null,null,null,null,null,null,null,0]
[null,null,{"$f":"IF(NOT('Eval 2'!G11=\"\"),'Eval 2'!F11,\"\")","v":""},null,null,null,null,null,null,null,null,null,null,null,null,null,null,null,null,null,null,null,null,0]
[null,null,{"$f":"IF(NOT('Eval 2'!G12=\"\"),'Eval 2'!F12,\"\")","v":""},null,null,null,null,null,null,null,null,null,null,null,null,null,null,null,null,null,null,null,null,0]
[null,null,{"$f":"IF(NOT('Eval 2'!G13=\"\"),'Eval 2'!F13,\"\")","v":""},null,null,null,null,null,null,null,null,null,null,null,null,null,null,null,null,null,null,null,null,0]
[null,"Linge",{"$f":"IF(NOT('Chapitre II'!C137=1),'PAQ type GREPHH'!C84,\"\")","v":""},null,null,null,null,null,null,null,null,null,null,null,null,null,null,null,null,null,null,null,null,0]
[null,null,{"$f":"IF(AND('Chapitre II'!C137=1,NOT('Chapitre II'!C140=1)),'PAQ type GREPHH'!C85,\"\")","v":""},null,null,null,null,null,null,null,null,null,null,null,null,null,null,null,null,null,null,null,null,0]
[null,null,{"$f":"IF(AND('Chapitre II'!C137=1,NOT('Chapitre II'!C142=1)),'PAQ type GREPHH'!C86,\"\")","v":""},null,null,null,null,null,null,null,null,null,null,null,null,null,null,null,null,null,null,null,null,0]
[null,null,{"$f":"IF(AND('Chapitre II'!C137=1,NOT('Chapitre II'!C144=1)),'PAQ type GREPHH'!C87,\"\")","v":""},null,null,null,null,null,null,null,null,null,null,null,null,null,null,null,null,null,null,null,null,0]
[null,null,{"$f":"IF(NOT('Chapitre II'!C147=1),'PAQ type GREPHH'!C88,\"\")","v":"Garder le linge non filmé à l'abri des contaminations jusqu'à l'utilisation (housse, local…)"},null,null,null,null,null,null,null,null,null,null,null,null,null,null,null,null,null,null,null,null,1]
[null,null,{"$f":"IF(NOT('Chapitre II'!C149=1),'PAQ type GREPHH'!C89,\"\")","v":"Organiser le stockage du linge propre dans un chariot, armoire  ou  local fermé"},null,null,null,null,null,null,null,null,null,null,null,null,null,null,null,null,null,null,null,null,1]
[null,null,{"$f":"IF(NOT('Chapitre II'!C151=1),'PAQ type GREPHH'!C90,\"\")","v":"Mettre en œuvre l'hygiène des mains avant toute manipulation du linge propre (à inclure dans la procédure)"},null,null,null,null,null,null,null,null,null,null,null,null,null,null,null,null,null,null,null,null,1]
[null,null,{"$f":"IF(NOT('Chapitre II'!C156=1),'PAQ type GREPHH'!C91,\"\")","v":""},null,null,null,null,null,null,null,null,null,null,null,null,null,null,null,null,null,null,null,null,0]
[null,null,{"$f":"IF(AND('Chapitre II'!C156=1,NOT('Chapitre II'!C159=1)),'PAQ type GREPHH'!C92,\"\")","v":""},null,null,null,null,null,null,null,null,null,null,null,null,null,null,null,null,null,null,null,null,0]
[null,null,{"$f":"IF(AND('Chapitre II'!C156=1,NOT('Chapitre II'!C161=1)),'PAQ type GREPHH'!C93,\"\")","v":"Diffuser la procédure linge sale"},null,null,null,null,null,null,null,null,null,null,null,null,null,null,null,null,null,null,null,null,1]
[null,null,{"$f":"IF(AND('Chapitre II'!C156=1,NOT('Chapitre II'!C163=1)),'PAQ type GREPHH'!C94,\"\")","v":"Réévaluer la procédure linge sale"},null,null,null,null,null,null,null,null,null,null,null,null,null,null,null,null,null,null,null,null,1]
[null,null,{"$f":"IF(AND('Chapitre II'!C156=1,NOT('Chapitre II'!C166=1)),'PAQ type GREPHH'!C95,\"\")","v":"Intégrer le tri à la production dans la procédure linge sale"},null,null,null,null,null,null,null,null,null,null,null,null,null,null,null,null,null,null,null,null,1]
[null,null,{"$f":"IF(AND('Chapitre II'!C156=1,NOT('Chapitre II'!C168=1)),'PAQ type GREPHH'!C96,\"\")","v":"Intégrer le conditionnement (sacs étanches) dans la procédure linge sale"},null,null,null,null,null,null,null,null,null,null,null,null,null,null,null,null,null,null,null,null,1]
[null,null,{"$f":"IF(AND('Chapitre II'!C156=1,NOT('Chapitre II'!C170)),'PAQ type GREPHH'!C97,\"\")","v":"Intégrer un lieu de stockage intermédiaire dans la procédure linge sale, ou organiser le bionettoyage immédiat de l'ascenseur au décours de la descente du linge sale si elle est réalisée en temps réel"},null,null,null,null,null,null,null,null,null,null,null,null,null,null,null,null,null,null,null,null,1]
[null,null,{"$f":"IF(NOT('Chapitre II'!C173=1),'PAQ type GREPHH'!C98,\"\")","v":"Demander le port de gants lors de la manipulation du linge sale"},null,null,null,null,null,null,null,null,null,null,null,null,null,null,null,null,null,null,null,null,{"$f":"IF(OR(NOT(C138=\"\"),NOT(D138=\"\"),NOT(E138=\"\"),NOT(F138=\"\")),1,0)","v":1}]
[null,null,{"$f":"IF(NOT('Chapitre II'!C175=1),'PAQ type GREPHH'!C99,\"\")","v":"Demander une hygiène des mains après manipulation du linge sale"},null,null,null,null,null,null,null,null,null,null,null,null,null,null,null,null,null,null,null,null,1]
[null,null,{"$f":"IF(NOT('Chapitre II'!C177=1),'PAQ type GREPHH'!C100,\"\")","v":"Demander la protection de la tenue avec des tabliers UU lors de la manipulation du linge sale"},null,null,null,null,null,null,null,null,null,null,null,null,null,null,null,null,null,null,null,null,1]
[null,null,{"$f":"IF(NOT('Chapitre II'!C179=1),'PAQ type GREPHH'!C101,\"\")","v":"Mettre en place les moyens alloués permettant d'appliquer la procédure du circuit du linge avec les précautions standard"},null,null,null,null,null,null,null,null,null,null,null,null,null,null,null,null,null,null,null,null,1]
[null,null,{"$f":"IF(NOT('Chapitre II'!C181=1),'PAQ type GREPHH'!C102,\"\")","v":"Prévoir un chariot /armoire/ local dédié fermé pour le linge propre"},null,null,null,null,null,null,null,null,null,null,null,null,null,null,null,null,null,null,null,null,1]
[null,null,{"$f":"IF(NOT('Chapitre II'!C183=1),'PAQ type GREPHH'!C103,\"\")","v":"Fournir des sacs permettant le tri du linge sale /souillé dès la production"},null,null,null,null,null,null,null,null,null,null,null,null,null,null,null,null,null,null,null,null,1]
[null,null,{"$f":"IF(NOT('Chapitre II'!C185=1),'PAQ type GREPHH'!C104,\"\")","v":"Mettre à disposition du personnel le matériel de protection pour la gestion du linge sale"},null,null,null,null,null,null,null,null,null,null,null,null,null,null,null,null,null,null,null,null,1]
[null,null,{"$f":"IF(NOT('Eval 2'!G19=\"\"),'Eval 2'!F19,\"\")","v":""},null,null,null,null,null,null,null,null,null,null,null,null,null,null,null,null,null,null,null,null,0]
[null,null,{"$f":"IF(NOT('Eval 2'!G20=\"\"),'Eval 2'!F20,\"\")","v":""},null,null,null,null,null,null,null,null,null,null,null,null,null,null,null,null,null,null,null,null,0]
[null,null,{"$f":"IF(NOT('Eval 2'!G21=\"\"),'Eval 2'!F21,\"\")","v":""},null,null,null,null,null,null,null,null,null,null,null,null,null,null,null,null,null,null,null,null,0]
[null,null,{"$f":"IF(NOT('Eval 2'!G22=\"\"),'Eval 2'!F22,\"\")","v":""},null,null,null,null,null,null,null,null,null,null,null,null,null,null,null,null,null,null,null,null,0]
[null,null,{"$f":"IF(NOT('Eval 2'!G23=\"\"),'Eval 2'!F23,\"\")","v":""},null,null,null,null,null,null,null,null,null,null,null,null,null,null,null,null,null,null,null,null,0]
[null,null,{"$f":"IF(NOT('Eval 2'!G24=\"\"),'Eval 2'!F24,\"\")","v":""},null,null,null,null,null,null,null,null,null,null,null,null,null,null,null,null,null,null,null,null,0]
[null,"Gestion des déchets",{"$f":"IF(NOT('Chapitre II'!C190=1),'PAQ type GREPHH'!C105,\"\")","v":"Rédiger, valider et diffuser la procédure déchet"},null,null,null,null,null,null,null,null,null,null,null,null,null,null,null,null,null,null,null,null,1]
[null,null,{"$f":"IF(AND('Chapitre II'!C190=1,NOT('Chapitre II'!C193=1)),'PAQ type GREPHH'!C106,\"\")","v":""},null,null,null,null,null,null,null,null,null,null,null,null,null,null,null,null,null,null,null,null,0]
[null,null,{"$f":"IF(AND('Chapitre II'!C190=1,NOT('Chapitre II'!C195=1)),'PAQ type GREPHH'!C107,\"\")","v":""},null,null,null,null,null,null,null,null,null,null,null,null,null,null,null,null,null,null,null,null,0]
[null,null,{"$f":"IF(AND('Chapitre II'!C190=1,NOT('Chapitre II'!C197=1)),'PAQ type GREPHH'!C108,\"\")","v":""},null,null,null,null,null,null,null,null,null,null,null,null,null,null,null,null,null,null,null,null,0]
[null,null,{"$f":"IF(NOT('Chapitre II'!C199=1),'PAQ type GREPHH'!C109,\"\")","v":"Nommer une personne responsable de la politique de tri des déchets"},null,null,null,null,null,null,null,null,null,null,null,null,null,null,null,null,null,null,null,null,1]
[null,null,{"$f":"IF(AND('Chapitre II'!C199=1,NOT('Chapitre II'!C202=1)),'PAQ type GREPHH'!C110,\"\")","v":""},null,null,null,null,null,null,null,null,null,null,null,null,null,null,null,null,null,null,null,null,0]
[null,null,{"$f":"IF(AND('Chapitre II'!C199=1,NOT('Chapitre II'!C204=1)),'PAQ type GREPHH'!C111,\"\")","v":""},null,null,null,null,null,null,null,null,null,null,null,null,null,null,null,null,null,null,null,null,0]
[null,null,{"$f":"IF(AND('Chapitre II'!C199=1,NOT('Chapitre II'!C206=1)),'PAQ type GREPHH'!C112,\"\")","v":""},null,null,null,null,null,null,null,null,null,null,null,null,null,null,null,null,null,null,null,null,0]
[null,null,{"$f":"IF(AND('Chapitre II'!C199=1,NOT('Chapitre II'!C208=1)),'PAQ type GREPHH'!C113,\"\")","v":""},null,null,null,null,null,null,null,null,null,null,null,null,null,null,null,null,null,null,null,null,0]
[null,null,{"$f":"IF(AND(NOT('Chapitre II'!C211<=15),NOT('Chapitre II'!C211>100),NOT('Chapitre II'!C213<=7)),'PAQ type GREPHH'!C115,\"\")","v":""},null,null,null,null,null,null,null,null,null,null,null,null,null,null,null,null,null,null,null,null,0]
[null,null,{"$f":"IF(AND('Chapitre II'!C211>=5,'Chapitre II'!C211<=15,NOT('Chapitre II'!C213<=30)),'PAQ type GREPHH'!C116,\"\")","v":""},null,null,null,null,null,null,null,null,null,null,null,null,null,null,null,null,null,null,null,null,0]
[null,null,{"$f":"IF(AND('Chapitre II'!C211>=100,NOT('Chapitre II'!C213<=3)),'PAQ type GREPHH'!C117,\"\")","v":""},null,null,null,null,null,null,null,null,null,null,null,null,null,null,null,null,null,null,null,null,0]
[null,null,{"$f":"IF(AND(OR(NOT('Chapitre II'!C216=1),NOT('Chapitre II'!C218=1),NOT('Chapitre II'!C220=1))),'PAQ type GREPHH'!C114,\"\")","v":"Intégrer les précautions standard dans la procédure / politique déchets puis rédiger, valider et diffuser"},null,null,null,null,null,null,null,null,null,null,null,null,null,null,null,null,null,null,null,null,1]
[null,null,{"$f":"IF(NOT('Chapitre II'!C223=1),'PAQ type GREPHH'!C118,\"\")","v":"Mettre à disposition des professionnels des sacs à déchets OM"},null,null,null,null,null,null,null,null,null,null,null,null,null,null,null,null,null,null,null,null,1]
[null,null,{"$f":"IF(NOT('Chapitre II'!C225=1),'PAQ type GREPHH'!C119,\"\")","v":"Mettre à disposition des professionnels des sacs ou cartons pour les DASRI"},null,null,null,null,null,null,null,null,null,null,null,null,null,null,null,null,null,null,null,null,1]
[null,null,{"$f":"IF(NOT('Chapitre II'!C227=1),'PAQ type GREPHH'!C120,\"\")","v":"Mettre à disposition des professionnels des collecteurs OPCT norme NFX 30500"},null,null,null,null,null,null,null,null,null,null,null,null,null,null,null,null,null,null,null,null,1]
[null,null,{"$f":"IF(NOT('Chapitre II'!C229=1),'PAQ type GREPHH'!C121,\"\")","v":"Mettre à la disposition du personnel une tenue de protection"},null,null,null,null,null,null,null,null,null,null,null,null,null,null,null,null,null,null,null,null,1]
[null,null,{"$f":"IF(NOT('Eval 2'!G14=\"\"),'Eval 2'!F14,\"\")","v":""},null,null,null,null,null,null,null,null,null,null,null,null,null,null,null,null,null,null,null,null,0]
[null,null,{"$f":"IF(NOT('Eval 2'!G15=\"\"),'Eval 2'!F15,\"\")","v":""},null,null,null,null,null,null,null,null,null,null,null,null,null,null,null,null,null,null,null,null,0]
[null,null,{"$f":"IF(NOT('Eval 2'!G16=\"\"),'Eval 2'!F16,\"\")","v":""},null,null,null,null,null,null,null,null,null,null,null,null,null,null,null,null,null,null,null,null,0]
[null,null,{"$f":"IF(NOT('Eval 2'!G17=\"\"),'Eval 2'!F17,\"\")","v":""},null,null,null,null,null,null,null,null,null,null,null,null,null,null,null,null,null,null,null,null,0]
[null,null,{"$f":"IF(NOT('Eval 2'!G18=\"\"),'Eval 2'!F18,\"\")","v":""},null,null,null,null,null,null,null,null,null,null,null,null,null,null,null,null,null,null,null,null,0]
[null,"Gestion de la qualité de l'eau",{"$f":"IF(NOT('Chapitre II'!C236=1),'PAQ type GREPHH'!C123,\"\")","v":"Réaliser des prélèvement à la recherche de légionnelle dans l'ECS au moins une fois par an"},null,null,null,null,null,null,null,null,null,null,null,null,null,null,null,null,null,null,null,null,1]
[null,null,{"$f":"IF(NOT('Chapitre II'!C238=1),'PAQ type GREPHH'!C125,\"\")","v":"Choisir un laboratoire accrédité COFRAC"},null,null,null,null,null,null,null,null,null,null,null,null,null,null,null,null,null,null,null,null,1]
[null,null,{"$f":"IF(NOT('Chapitre II'!C240=1),'PAQ type GREPHH'!C126,\"\")","v":"Réaliser au moins 5 prélèvements annuels"},null,null,null,null,null,null,null,null,null,null,null,null,null,null,null,null,null,null,null,null,1]
[null,null,{"$f":"IF(AND(OR('Chapitre II'!C243=2,'Chapitre II'!C245=2,'Chapitre II'!C247=2,'Chapitre II'!C249=2)),'PAQ type GREPHH'!C128,\"\")","v":""},null,null,null,null,null,null,null,null,null,null,null,null,null,null,null,null,null,null,null,null,0]
[null,null,{"$f":"IF(NOT('Chapitre II'!C252=1),'PAQ type GREPHH'!C122,\"\")","v":"Mettre en place le carnet sanitaire"},null,null,null,null,null,null,null,null,null,null,null,null,null,null,null,null,null,null,null,null,1]
[null,null,{"$f":"IF(AND('Chapitre II'!C252=1,NOT('Chapitre II'!C255=1)),'PAQ type GREPHH'!C127,\"\")","v":""},null,null,null,null,null,null,null,null,null,null,null,null,null,null,null,null,null,null,null,null,0]
[null,null,{"$f":"IF(AND('Chapitre II'!C252=1,NOT('Chapitre II'!C257=1)),'PAQ type GREPHH'!C124,\"\")","v":""},null,null,null,null,null,null,null,null,null,null,null,null,null,null,null,null,null,null,null,null,0]
[null,null,{"$f":"IF(AND('Chapitre II'!C252=1,NOT('Chapitre II'!C259=1)),'PAQ type GREPHH'!C129,\"\")","v":""},null,null,null,null,null,null,null,null,null,null,null,null,null,null,null,null,null,null,null,null,0]
[null,null,{"$f":"IF(AND('Chapitre II'!C252=1,NOT('Chapitre II'!C261=1)),'PAQ type GREPHH'!C130,\"\")","v":""},null,null,null,null,null,null,null,null,null,null,null,null,null,null,null,null,null,null,null,null,0]
[null,null,{"$f":"IF(AND('Chapitre II'!C252=1,NOT('Chapitre II'!C263=1)),'PAQ type GREPHH'!C131,\"\")","v":""},null,null,null,null,null,null,null,null,null,null,null,null,null,null,null,null,null,null,null,null,0]
[null,null,{"$f":"IF(AND('Chapitre II'!C252=1,'Chapitre II'!C265=2),'PAQ type GREPHH'!C132,\"\")","v":""},null,null,null,null,null,null,null,null,null,null,null,null,null,null,null,null,null,null,null,null,0]
[null,null,{"$f":"IF(AND('Chapitre II'!C252=1,'Chapitre II'!C267=2),'PAQ type GREPHH'!C133,\"\")","v":""},null,null,null,null,null,null,null,null,null,null,null,null,null,null,null,null,null,null,null,null,0]
[null,null,{"$f":"IF(AND('Chapitre II'!C252=1,NOT('Chapitre II'!C269=1)),'PAQ type GREPHH'!C134,\"\")","v":""},null,null,null,null,null,null,null,null,null,null,null,null,null,null,null,null,null,null,null,null,0]
[null,null,{"$f":"IF(AND('Chapitre II'!C252=1,NOT('Chapitre II'!C271=1)),'PAQ type GREPHH'!C135,\"\")","v":""},null,null,null,null,null,null,null,null,null,null,null,null,null,null,null,null,null,null,null,null,0]
[null,null,{"$f":"IF(AND('Chapitre II'!C252=1,NOT('Chapitre II'!C273=1)),'PAQ type GREPHH'!C136,\"\")","v":""},null,null,null,null,null,null,null,null,null,null,null,null,null,null,null,null,null,null,null,null,0]
[null,null,{"$f":"IF(AND('Chapitre II'!C252=1,NOT('Chapitre II'!C275=1)),'PAQ type GREPHH'!C137,\"\")","v":""},null,null,null,null,null,null,null,null,null,null,null,null,null,null,null,null,null,null,null,null,0]
[null,null,{"$f":"IF(AND('Chapitre II'!C252=1,NOT('Chapitre II'!C277=1)),'PAQ type GREPHH'!C138,\"\")","v":""},null,null,null,null,null,null,null,null,null,null,null,null,null,null,null,null,null,null,null,null,0]
[null,null,{"$f":"IF(AND('Chapitre II'!C252=1,NOT('Chapitre II'!C279=1)),'PAQ type GREPHH'!C139,\"\")","v":""},null,null,null,null,null,null,null,null,null,null,null,null,null,null,null,null,null,null,null,null,0]
[null,null,{"$f":"IF(NOT('Chapitre II'!C282=1),'PAQ type GREPHH'!C140,\"\")","v":"Rédiger,valider et diffuser, la procédure conduite à tenir devant une contamination (légionelle) du réseau ECS ou EF , détaillant la conduite à tenir dans l'établissement (arrêt ou sécurisation des usages à risques, actions curatives sur le réseau...), et incluant l'information systématique du médecin coordonateur"},null,null,null,null,null,null,null,null,null,null,null,null,null,null,null,null,null,null,null,null,1]
[null,null,{"$f":"IF(NOT('Chapitre II'!C284=1),'PAQ type GREPHH'!C141,\"\")","v":"Inclure l'information systématique du médecin coordonnateur en cas de dysfonctionnement ou analyse non conforme sur le réseau d'eau"},null,null,null,null,null,null,null,null,null,null,null,null,null,null,null,null,null,null,null,null,1]
[null,null,{"$f":"IF(NOT('Chapitre II'!C287=1),'PAQ type GREPHH'!C142,\"\")","v":"Rédiger,valider et diffuser, la procédure conduite à tenir devant une légionellose pulmonaire, détaillant la prise en charge du résident"},null,null,null,null,null,null,null,null,null,null,null,null,null,null,null,null,null,null,null,null,1]
[null,null,{"$f":"IF(NOT('Chapitre II'!C289=1),'PAQ type GREPHH'!C143,\"\")","v":"Inclure dans la procédure CAT en cas de légionellose les actions à mener concernant le réseau d'eau"},null,null,null,null,null,null,null,null,null,null,null,null,null,null,null,null,null,null,null,null,1]
[null,null,{"$f":"IF(NOT('Chapitre II'!C291=1),'PAQ type GREPHH'!C144,\"\")","v":"Inclure dans la procédure CAT en cas de légionellose les actions à mener concernant la déclaration obligatoire du cas"},null,null,null,null,null,null,null,null,null,null,null,null,null,null,null,null,null,null,null,null,1]
[null,null,{"$f":"IF(NOT('Chapitre II'!C296=1),'PAQ type GREPHH'!C145,\"\")","v":"Contrôler annuellement la potabilité de l'eau sur l'arrivée de l'eau dans la structure et les points de consommation éventuels (cuisine...)"},null,null,null,null,null,null,null,null,null,null,null,null,null,null,null,null,null,null,null,null,1]
[null,null,{"$f":"IF(AND('Chapitre II'!C298=1,NOT('Chapitre II'!C300=1)),'PAQ type GREPHH'!C146,\"\")","v":""},null,null,null,null,null,null,null,null,null,null,null,null,null,null,null,null,null,null,null,null,0]
[null,null,{"$f":"IF(AND('Chapitre II'!C298=1,NOT('Chapitre II'!C302=1)),'PAQ type GREPHH'!C147,\"\")","v":""},null,null,null,null,null,null,null,null,null,null,null,null,null,null,null,null,null,null,null,null,0]
[null,null,{"$f":"IF(AND('Chapitre II'!C304=1,NOT('Chapitre II'!C306=1)),'PAQ type GREPHH'!C148,\"\")","v":""},null,null,null,null,null,null,null,null,null,null,null,null,null,null,null,null,null,null,null,null,0]
[null,null,{"$f":"IF(AND('Chapitre II'!C304=1,NOT('Chapitre II'!C308=1)),'PAQ type GREPHH'!C149,\"\")","v":""},null,null,null,null,null,null,null,null,null,null,null,null,null,null,null,null,null,null,null,null,0]
[null,null,{"$f":"IF(AND('Chapitre II'!C304=1,NOT('Chapitre II'!C310=1)),'PAQ type GREPHH'!C150,\"\")","v":""},null,null,null,null,null,null,null,null,null,null,null,null,null,null,null,null,null,null,null,null,0]
[null,null,{"$f":"IF(AND('Chapitre II'!C312=1,NOT('Chapitre II'!C314=1)),'PAQ type GREPHH'!C151,\"\")","v":""},null,null,null,null,null,null,null,null,null,null,null,null,null,null,null,null,null,null,null,null,0]
[null,null,{"$f":"IF(AND('Chapitre II'!C312=1,NOT('Chapitre II'!C316=1)),'PAQ type GREPHH'!C152,\"\")","v":""},null,null,null,null,null,null,null,null,null,null,null,null,null,null,null,null,null,null,null,null,0]
[null,null,{"$f":"IF(NOT('Chapitre II'!C319=1),'PAQ type GREPHH'!C153,\"\")","v":"Rédiger, valider et diffuser une procédure de conduite à tenir en cas de résultats d'analyse non conforme de la qualité de l'eau de consommation alimentaire, ou de dysfonctionnement du système de distribution d'eau de consommation"},null,null,null,null,null,null,null,null,null,null,null,null,null,null,null,null,null,null,null,null,1]
[null,null,{"$f":"IF(NOT('Chapitre II'!C321=1),'PAQ type GREPHH'!C154,\"\")","v":"Intégrer dans la procédure une alerte systématique du médecin coordonnateur en cas de dysfonctionnement du système de distribution de l'eau potable ou d'analyse non conforme"},null,null,null,null,null,null,null,null,null,null,null,null,null,null,null,null,null,null,null,null,1]
[null,null,{"$f":"IF(NOT('Eval 2'!G25=\"\"),'Eval 2'!F25,\"\")","v":""},null,null,null,null,null,null,null,null,null,null,null,null,null,null,null,null,null,null,null,null,{"$f":"IF(OR(NOT(C206=\"\"),NOT(D206=\"\"),NOT(E206=\"\"),NOT(F206=\"\")),1,0)","v":0}]
[null,null,{"$f":"IF(NOT('Eval 2'!G26=\"\"),'Eval 2'!F26,\"\")","v":""},null,null,null,null,null,null,null,null,null,null,null,null,null,null,null,null,null,null,null,null,0]
[null,null,{"$f":"IF(NOT('Eval 2'!G27=\"\"),'Eval 2'!F27,\"\")","v":""},null,null,null,null,null,null,null,null,null,null,null,null,null,null,null,null,null,null,null,null,0]
[null,null,{"$f":"IF(NOT('Eval 2'!G28=\"\"),'Eval 2'!F28,\"\")","v":""},null,null,null,null,null,null,null,null,null,null,null,null,null,null,null,null,null,null,null,null,0]
[null,null,{"$f":"IF(NOT('Eval 2'!G29=\"\"),'Eval 2'!F29,\"\")","v":""},null,null,null,null,null,null,null,null,null,null,null,null,null,null,null,null,null,null,null,null,0]
[null,null,{"$f":"IF(NOT('Eval 2'!G30=\"\"),'Eval 2'!F30,\"\")","v":""},null,null,null,null,null,null,null,null,null,null,null,null,null,null,null,null,null,null,null,null,0]
[null,null,{"$f":"IF(NOT('Eval 2'!G31=\"\"),'Eval 2'!F31,\"\")","v":""},null,null,null,null,null,null,null,null,null,null,null,null,null,null,null,null,null,null,null,null,0]
[null,null,{"$f":"IF(NOT('Eval 2'!G32=\"\"),'Eval 2'!F32,\"\")","v":""},null,null,null,null,null,null,null,null,null,null,null,null,null,null,null,null,null,null,null,null,0]
[null,null,{"$f":"IF(NOT('Eval 2'!G33=\"\"),'Eval 2'!F33,\"\")","v":""},null,null,null,null,null,null,null,null,null,null,null,null,null,null,null,null,null,null,null,null,0]
[null,null,{"$f":"IF(NOT('Eval 2'!G34=\"\"),'Eval 2'!F34,\"\")","v":""},null,null,null,null,null,null,null,null,null,null,null,null,null,null,null,null,null,null,null,null,0]
[null,null,{"$f":"IF(NOT('Eval 2'!G35=\"\"),'Eval 2'!F35,\"\")","v":""},null,null,null,null,null,null,null,null,null,null,null,null,null,null,null,null,null,null,null,null,0]
["Chapitre","Thèmes","Axes d'amélioration","Priorité",null,null,"Responsable","Moyens",{"$f":"I71","v":2021},null,null,null,"Objectif atteint O/N/EC",{"$f":"I217+1","v":2022},null,null,null,"Objectif atteint O/N/EC",{"$f":"N217+1","v":2023},null,null,null,"Objectif atteint O/N/EC",1]
[null,null,null,"H","M","F",null,null,"1er ","2eme","3eme","4eme",null,"1er","2eme","3eme","4eme",null,"1er","2eme","3eme","4eme",null,1]
["3- Gestion du matériel de soins","Gestion du matériel de soins",{"$f":"IF(NOT('Chapitre III'!C10=1),'PAQ type GREPHH'!C155,\"\")","v":"Privilégier l'utilisation de DM à usage unique"},null,null,null,null,null,null,null,null,null,null,null,null,null,null,null,null,null,null,null,null,{"$f":"IF(OR(NOT(C219=\"\"),NOT(D219=\"\"),NOT(E219=\"\"),NOT(F219=\"\")),1,0)","v":1}]
[null,null,{"$f":"IF(NOT('Chapitre III'!C12=1),'PAQ type GREPHH'!C156,\"\")","v":"Rédiger valider diffuser la procédure  de nettoyage-désinfection du matériel de soins réutilisable"},null,null,null,null,null,null,null,null,null,null,null,null,null,null,null,null,null,null,null,null,1]
[null,null,{"$f":"IF(AND('Chapitre III'!C23=1,NOT('Chapitre III'!C25=1)),'PAQ type GREPHH'!C157,\"\")","v":""},null,null,null,null,null,null,null,null,null,null,null,null,null,null,null,null,null,null,null,null,0]
[null,null,{"$f":"IF(AND('Chapitre III'!C23=1,'Chapitre III'!C25=1,NOT('Chapitre III'!C27=1)),'PAQ type GREPHH'!C158,\"\")","v":""},null,null,null,null,null,null,null,null,null,null,null,null,null,null,null,null,null,null,null,null,0]
[null,null,{"$f":"IF(AND('Chapitre III'!C23=1,NOT('Chapitre III'!C29=1)),'PAQ type GREPHH'!C159,\"\")","v":""},null,null,null,null,null,null,null,null,null,null,null,null,null,null,null,null,null,null,null,null,0]
[null,null,{"$f":"IF(AND('Chapitre III'!C31=1,NOT('Chapitre III'!C33=1)),'PAQ type GREPHH'!C160,\"\")","v":""},null,null,null,null,null,null,null,null,null,null,null,null,null,null,null,null,null,null,null,null,0]
[null,null,{"$f":"IF(AND('Chapitre III'!C31=1,'Chapitre III'!C33=1,NOT('Chapitre III'!C35=1)),'PAQ type GREPHH'!C161,\"\")","v":""},null,null,null,null,null,null,null,null,null,null,null,null,null,null,null,null,null,null,null,null,0]
[null,null,{"$f":"IF(AND('Chapitre III'!C31=1,NOT('Chapitre III'!C37=1)),'PAQ type GREPHH'!C162,\"\")","v":""},null,null,null,null,null,null,null,null,null,null,null,null,null,null,null,null,null,null,null,null,0]
[null,null,{"$f":"IF(AND('Chapitre III'!C39=1,NOT('Chapitre III'!C41=1)),'PAQ type GREPHH'!C163,\"\")","v":""},null,null,null,null,null,null,null,null,null,null,null,null,null,null,null,null,null,null,null,null,0]
[null,null,{"$f":"IF(AND('Chapitre III'!C39=1,'Chapitre III'!C41=1,NOT('Chapitre III'!C43=1)),'PAQ type GREPHH'!C164,\"\")","v":""},null,null,null,null,null,null,null,null,null,null,null,null,null,null,null,null,null,null,null,null,0]
[null,null,{"$f":"IF(AND('Chapitre III'!C39=1,NOT('Chapitre III'!C45=1)),'PAQ type GREPHH'!C165,\"\")","v":""},null,null,null,null,null,null,null,null,null,null,null,null,null,null,null,null,null,null,null,null,0]
[null,null,{"$f":"IF(AND('Chapitre III'!C47=1,NOT('Chapitre III'!C49=1)),'PAQ type GREPHH'!C166,\"\")","v":""},null,null,null,null,null,null,null,null,null,null,null,null,null,null,null,null,null,null,null,null,0]
[null,null,{"$f":"IF(AND('Chapitre III'!C47=1,'Chapitre III'!C49=1,NOT('Chapitre III'!C51=1)),'PAQ type GREPHH'!C167,\"\")","v":""},null,null,null,null,null,null,null,null,null,null,null,null,null,null,null,null,null,null,null,null,0]
[null,null,{"$f":"IF(AND('Chapitre III'!C47=1,NOT('Chapitre III'!C53=1)),'PAQ type GREPHH'!C168,\"\")","v":""},null,null,null,null,null,null,null,null,null,null,null,null,null,null,null,null,null,null,null,null,0]
[null,null,{"$f":"IF(AND('Chapitre III'!C55=1,NOT('Chapitre III'!C57=1)),'PAQ type GREPHH'!C169,\"\")","v":""},null,null,null,null,null,null,null,null,null,null,null,null,null,null,null,null,null,null,null,null,0]
[null,null,{"$f":"IF(AND('Chapitre III'!C55=1,'Chapitre III'!C57=1,NOT('Chapitre III'!C59=1)),'PAQ type GREPHH'!C170,\"\")","v":""},null,null,null,null,null,null,null,null,null,null,null,null,null,null,null,null,null,null,null,null,0]
[null,null,{"$f":"IF(AND('Chapitre III'!C55=1,NOT('Chapitre III'!C62=1),NOT('Chapitre III'!C64=1)),'PAQ type GREPHH'!C171,\"\")","v":""},null,null,null,null,null,null,null,null,null,null,null,null,null,null,null,null,null,null,null,null,0]
[null,null,{"$f":"IF(AND('Chapitre III'!C66=1,NOT('Chapitre III'!C68=1)),'PAQ type GREPHH'!C172,\"\")","v":""},null,null,null,null,null,null,null,null,null,null,null,null,null,null,null,null,null,null,null,null,0]
[null,null,{"$f":"IF(AND('Chapitre III'!C66=1,'Chapitre III'!C68=1,NOT('Chapitre III'!C70=1)),'PAQ type GREPHH'!C173,\"\")","v":""},null,null,null,null,null,null,null,null,null,null,null,null,null,null,null,null,null,null,null,null,0]
[null,null,{"$f":"IF(AND('Chapitre III'!C66=1,NOT('Chapitre III'!C73=1),NOT('Chapitre III'!C75=1)),'PAQ type GREPHH'!C174,\"\")","v":""},null,null,null,null,null,null,null,null,null,null,null,null,null,null,null,null,null,null,null,null,0]
[null,null,{"$f":"IF(AND('Chapitre III'!C77=1,NOT('Chapitre III'!C79=1)),'PAQ type GREPHH'!C175,\"\")","v":""},null,null,null,null,null,null,null,null,null,null,null,null,null,null,null,null,null,null,null,null,0]
[null,null,{"$f":"IF(AND('Chapitre III'!C77=1,'Chapitre III'!C79=1,NOT('Chapitre III'!C81=1)),'PAQ type GREPHH'!C176,\"\")","v":""},null,null,null,null,null,null,null,null,null,null,null,null,null,null,null,null,null,null,null,null,0]
[null,null,{"$f":"IF(AND('Chapitre III'!C77=1,NOT('Chapitre III'!C84=1),NOT('Chapitre III'!C86=1)),'PAQ type GREPHH'!C177,\"\")","v":""},null,null,null,null,null,null,null,null,null,null,null,null,null,null,null,null,null,null,null,null,0]
[null,null,{"$f":"IF(AND('Chapitre III'!C88=1,NOT('Chapitre III'!C90=1)),'PAQ type GREPHH'!C178,\"\")","v":""},null,null,null,null,null,null,null,null,null,null,null,null,null,null,null,null,null,null,null,null,0]
[null,null,{"$f":"IF(AND('Chapitre III'!C88=1,'Chapitre III'!C90=1,NOT('Chapitre III'!C92=1)),'PAQ type GREPHH'!C179,\"\")","v":""},null,null,null,null,null,null,null,null,null,null,null,null,null,null,null,null,null,null,null,null,0]
[null,null,{"$f":"IF(AND('Chapitre III'!C88=1,NOT('Chapitre III'!C95=1),NOT('Chapitre III'!C97=1)),'PAQ type GREPHH'!C180,\"\")","v":""},null,null,null,null,null,null,null,null,null,null,null,null,null,null,null,null,null,null,null,null,0]
[null,null,{"$f":"IF(AND('Chapitre III'!C99=1,NOT('Chapitre III'!C101=1)),'PAQ type GREPHH'!C181,\"\")","v":""},null,null,null,null,null,null,null,null,null,null,null,null,null,null,null,null,null,null,null,null,0]
[null,null,{"$f":"IF(AND('Chapitre III'!C99=1,'Chapitre III'!C101=1,NOT('Chapitre III'!C103=1)),'PAQ type GREPHH'!C182,\"\")","v":""},null,null,null,null,null,null,null,null,null,null,null,null,null,null,null,null,null,null,null,null,0]
[null,null,{"$f":"IF(AND('Chapitre III'!C99=1,NOT('Chapitre III'!C106=1),NOT('Chapitre III'!C108=1)),'PAQ type GREPHH'!C183,\"\")","v":""},null,null,null,null,null,null,null,null,null,null,null,null,null,null,null,null,null,null,null,null,0]
[null,null,{"$f":"IF(AND('Chapitre III'!C110=1,NOT('Chapitre III'!C112=1)),'PAQ type GREPHH'!C184,\"\")","v":""},null,null,null,null,null,null,null,null,null,null,null,null,null,null,null,null,null,null,null,null,0]
[null,null,{"$f":"IF(AND('Chapitre III'!C110=1,'Chapitre III'!C112=1,NOT('Chapitre III'!C114=1)),'PAQ type GREPHH'!C185,\"\")","v":""},null,null,null,null,null,null,null,null,null,null,null,null,null,null,null,null,null,null,null,null,0]
[null,null,{"$f":"IF(AND('Chapitre III'!C110=1,NOT('Chapitre III'!C117=1),NOT('Chapitre III'!C119=1)),'PAQ type GREPHH'!C186,\"\")","v":""},null,null,null,null,null,null,null,null,null,null,null,null,null,null,null,null,null,null,null,null,0]
[null,null,{"$f":"IF(AND('Chapitre III'!C121=1,NOT('Chapitre III'!C123=1)),'PAQ type GREPHH'!C187,\"\")","v":""},null,null,null,null,null,null,null,null,null,null,null,null,null,null,null,null,null,null,null,null,0]
[null,null,{"$f":"IF(AND('Chapitre III'!C121=1,'Chapitre III'!C123=1,NOT('Chapitre III'!C125=1)),'PAQ type GREPHH'!C188,\"\")","v":""},null,null,null,null,null,null,null,null,null,null,null,null,null,null,null,null,null,null,null,null,0]
[null,null,{"$f":"IF(AND('Chapitre III'!C121=1,NOT('Chapitre III'!C128=1),NOT('Chapitre III'!C130=1)),'PAQ type GREPHH'!C189,\"\")","v":""},null,null,null,null,null,null,null,null,null,null,null,null,null,null,null,null,null,null,null,null,0]
[null,null,{"$f":"IF(AND('Chapitre III'!C132=1,NOT('Chapitre III'!C134=1)),'PAQ type GREPHH'!C190,\"\")","v":""},null,null,null,null,null,null,null,null,null,null,null,null,null,null,null,null,null,null,null,null,0]
[null,null,{"$f":"IF(AND('Chapitre III'!C132=1,'Chapitre III'!C134=1,NOT('Chapitre III'!C136=1)),'PAQ type GREPHH'!C191,\"\")","v":""},null,null,null,null,null,null,null,null,null,null,null,null,null,null,null,null,null,null,null,null,0]
[null,null,{"$f":"IF(AND('Chapitre III'!C132=1,NOT('Chapitre III'!C138=1)),'PAQ type GREPHH'!C192,\"\")","v":""},null,null,null,null,null,null,null,null,null,null,null,null,null,null,null,null,null,null,null,null,0]
[null,null,{"$f":"IF(NOT('Eval 3'!G4=\"\"),'Eval 3'!F4,\"\")","v":""},null,null,null,null,null,null,null,null,null,null,null,null,null,null,null,null,null,null,null,null,0]
[null,null,{"$f":"IF(NOT('Eval 3'!G5=\"\"),'Eval 3'!F5,\"\")","v":""},null,null,null,null,null,null,null,null,null,null,null,null,null,null,null,null,null,null,null,null,0]
[null,null,{"$f":"IF(NOT('Eval 3'!G6=\"\"),'Eval 3'!F6,\"\")","v":""},null,null,null,null,null,null,null,null,null,null,null,null,null,null,null,null,null,null,null,null,0]
[null,null,{"$f":"IF(NOT('Eval 3'!G7=\"\"),'Eval 3'!F7,\"\")","v":""},null,null,null,null,null,null,null,null,null,null,null,null,null,null,null,null,null,null,null,null,0]
[null,null,{"$f":"IF(NOT('Eval 3'!G8=\"\"),'Eval 3'!F8,\"\")","v":""},null,null,null,null,null,null,null,null,null,null,null,null,null,null,null,null,null,null,null,null,0]
["Chapitre","Thèmes","Axes d'amélioration","Priorité",null,null,"Responsable","Moyens",{"$f":"I217","v":2021},null,null,null,"Objectif atteint O/N/EC",{"$f":"I262+1","v":2022},null,null,null,"Objectif atteint O/N/EC",{"$f":"N262+1","v":2023},null,null,null,"Objectif atteint O/N/EC",1]
[null,null,null,"H","M","F",null,null,"1er ","2eme","3eme","4eme",null,"1er","2eme","3eme","4eme",null,"1er","2eme","3eme","4eme",null,1]
["4- Gestion des soins","Actes infirmiers et de nursing",{"$f":"IF(NOT('Chapitre IV'!C15=1),'PAQ type GREPHH'!C193,\"\")","v":"Rédiger valider diffuser la procédure Aérosolthérapie"},null,null,null,null,null,null,null,null,null,null,null,null,null,null,null,null,null,null,null,null,{"$f":"IF(OR(NOT(C264=\"\"),NOT(D264=\"\"),NOT(E264=\"\"),NOT(F264=\"\")),1,0)","v":1}]
[null,null,{"$f":"IF(AND('Chapitre IV'!C15=1,NOT('Chapitre IV'!C17=1)),'PAQ type GREPHH'!C194,\"\")","v":""},null,null,null,null,null,null,null,null,null,null,null,null,null,null,null,null,null,null,null,null,0]
[null,null,{"$f":"IF(AND(NOT('Chapitre IV'!C21=1),NOT('Chapitre IV'!C21=3)),'PAQ type GREPHH'!C195,\"\")","v":"Rédiger valider diffuser la procédure alimentation entérale"},null,null,null,null,null,null,null,null,null,null,null,null,null,null,null,null,null,null,null,null,1]
[null,null,{"$f":"IF(AND('Chapitre IV'!C21=1,NOT('Chapitre IV'!C23=1)),'PAQ type GREPHH'!C196,\"\")","v":""},null,null,null,null,null,null,null,null,null,null,null,null,null,null,null,null,null,null,null,null,0]
[null,null,{"$f":"IF('Chapitre IV'!C27=2,'PAQ type GREPHH'!C197,\"\")","v":""},null,null,null,null,null,null,null,null,null,null,null,null,null,null,null,null,null,null,null,null,0]
[null,null,{"$f":"IF(AND('Chapitre IV'!C27=1,NOT('Chapitre IV'!C29=1)),'PAQ type GREPHH'!C198,\"\")","v":""},null,null,null,null,null,null,null,null,null,null,null,null,null,null,null,null,null,null,null,null,0]
[null,null,{"$f":"IF(NOT('Chapitre IV'!C33=1),'PAQ type GREPHH'!C199,\"\")","v":"Rédiger valider diffuser la procédure hygiène des mains et port de gants"},null,null,null,null,null,null,null,null,null,null,null,null,null,null,null,null,null,null,null,null,1]
[null,null,{"$f":"IF(AND('Chapitre IV'!C33=1,NOT('Chapitre IV'!C35=1)),'PAQ type GREPHH'!C200,\"\")","v":""},null,null,null,null,null,null,null,null,null,null,null,null,null,null,null,null,null,null,null,null,0]
[null,null,{"$f":"IF(NOT('Chapitre IV'!C39=1),'PAQ type GREPHH'!C201,\"\")","v":"Rédiger valider diffuser la procédure injection IM/SC/IV"},null,null,null,null,null,null,null,null,null,null,null,null,null,null,null,null,null,null,null,null,1]
[null,null,{"$f":"IF(AND('Chapitre IV'!C39=1,NOT('Chapitre IV'!C41=1)),'PAQ type GREPHH'!C202,\"\")","v":""},null,null,null,null,null,null,null,null,null,null,null,null,null,null,null,null,null,null,null,null,0]
[null,null,{"$f":"IF(NOT('Chapitre IV'!C45=1),'PAQ type GREPHH'!C203,\"\")","v":"Rédiger valider diffuser la procédure oxygénothérapie"},null,null,null,null,null,null,null,null,null,null,null,null,null,null,null,null,null,null,null,null,1]
[null,null,{"$f":"IF(AND('Chapitre IV'!C45=1,NOT('Chapitre IV'!C47=1)),'PAQ type GREPHH'!C204,\"\")","v":""},null,null,null,null,null,null,null,null,null,null,null,null,null,null,null,null,null,null,null,null,0]
[null,null,{"$f":"IF(NOT('Chapitre IV'!C51=1),'PAQ type GREPHH'!C205,\"\")","v":"Rédiger valider diffuser la procédure de prise en charge des plaies  (escarre ulcère…)"},null,null,null,null,null,null,null,null,null,null,null,null,null,null,null,null,null,null,null,null,1]
[null,null,{"$f":"IF(AND('Chapitre IV'!C51=1,NOT('Chapitre IV'!C53=1)),'PAQ type GREPHH'!C206,\"\")","v":""},null,null,null,null,null,null,null,null,null,null,null,null,null,null,null,null,null,null,null,null,0]
[null,null,{"$f":"IF('Chapitre IV'!C57=2,'PAQ type GREPHH'!C207,\"\")","v":""},null,null,null,null,null,null,null,null,null,null,null,null,null,null,null,null,null,null,null,null,0]
[null,null,{"$f":"IF(AND('Chapitre IV'!C57=1,NOT('Chapitre IV'!C59=1)),'PAQ type GREPHH'!C208,\"\")","v":""},null,null,null,null,null,null,null,null,null,null,null,null,null,null,null,null,null,null,null,null,0]
[null,null,{"$f":"IF(AND(NOT('Chapitre IV'!C63=1),NOT('Chapitre IV'!C63=3)),'PAQ type GREPHH'!C209,\"\")","v":"Rédiger valider diffuser la procédure pose d'une voie veineuse"},null,null,null,null,null,null,null,null,null,null,null,null,null,null,null,null,null,null,null,null,1]
[null,null,{"$f":"IF(AND('Chapitre IV'!C63=1,NOT('Chapitre IV'!C65=1)),'PAQ type GREPHH'!C210,\"\")","v":""},null,null,null,null,null,null,null,null,null,null,null,null,null,null,null,null,null,null,null,null,0]
[null,null,{"$f":"IF(NOT('Chapitre IV'!C69=1),'PAQ type GREPHH'!C211,\"\")","v":"Rédiger valider diffuser la procédure précautions complémentaires"},null,null,null,null,null,null,null,null,null,null,null,null,null,null,null,null,null,null,null,null,1]
[null,null,{"$f":"IF(AND('Chapitre IV'!C69=1,NOT('Chapitre IV'!C71=1)),'PAQ type GREPHH'!C212,\"\")","v":""},null,null,null,null,null,null,null,null,null,null,null,null,null,null,null,null,null,null,null,null,0]
[null,null,{"$f":"IF(NOT('Chapitre IV'!C75=1),'PAQ type GREPHH'!C213,\"\")","v":"Rédiger valider diffuser la procédure précautions standard"},null,null,null,null,null,null,null,null,null,null,null,null,null,null,null,null,null,null,null,null,1]
[null,null,{"$f":"IF(AND('Chapitre IV'!C75=1,NOT('Chapitre IV'!C77=1)),'PAQ type GREPHH'!C214,\"\")","v":""},null,null,null,null,null,null,null,null,null,null,null,null,null,null,null,null,null,null,null,null,0]
[null,null,{"$f":"IF('Chapitre IV'!C81=2,'PAQ type GREPHH'!C215,\"\")","v":""},null,null,null,null,null,null,null,null,null,null,null,null,null,null,null,null,null,null,null,null,0]
[null,null,{"$f":"IF(AND('Chapitre IV'!C81=1,NOT('Chapitre IV'!C83=1)),'PAQ type GREPHH'!C216,\"\")","v":""},null,null,null,null,null,null,null,null,null,null,null,null,null,null,null,null,null,null,null,null,0]
[null,null,{"$f":"IF(NOT('Chapitre IV'!C87=1),'PAQ type GREPHH'!C217,\"\")","v":"Rédiger valider diffuser la procédure soins de nursing (toilette, soins bucco-dentaire…)"},null,null,null,null,null,null,null,null,null,null,null,null,null,null,null,null,null,null,null,null,1]
[null,null,{"$f":"IF(AND('Chapitre IV'!C87=1,NOT('Chapitre IV'!C89=1)),'PAQ type GREPHH'!C218,\"\")","v":""},null,null,null,null,null,null,null,null,null,null,null,null,null,null,null,null,null,null,null,null,0]
[null,null,{"$f":"IF(AND(NOT('Chapitre IV'!C93=1),NOT('Chapitre IV'!C93=3)),'PAQ type GREPHH'!C219,\"\")","v":"Rédiger valider diffuser la procédure sondage vésical"},null,null,null,null,null,null,null,null,null,null,null,null,null,null,null,null,null,null,null,null,1]
[null,null,{"$f":"IF(AND('Chapitre IV'!C93=1,NOT('Chapitre IV'!C95=1)),'PAQ type GREPHH'!C220,\"\")","v":""},null,null,null,null,null,null,null,null,null,null,null,null,null,null,null,null,null,null,null,null,0]
[null,null,{"$f":"IF(AND(NOT('Chapitre IV'!C99=1),NOT('Chapitre IV'!C99=3)),'PAQ type GREPHH'!C221,\"\")","v":"Rédiger valider diffuser la procédure stomies"},null,null,null,null,null,null,null,null,null,null,null,null,null,null,null,null,null,null,null,null,1]
[null,null,{"$f":"IF(AND('Chapitre IV'!C99=1,NOT('Chapitre IV'!C101=1)),'PAQ type GREPHH'!C222,\"\")","v":""},null,null,null,null,null,null,null,null,null,null,null,null,null,null,null,null,null,null,null,null,0]
[null,null,{"$f":"IF(NOT('Eval 4'!G4=\"\"),'Eval 4'!F4,\"\")","v":""},null,null,null,null,null,null,null,null,null,null,null,null,null,null,null,null,null,null,null,null,0]
[null,null,{"$f":"IF(NOT('Eval 4'!G5=\"\"),'Eval 4'!F5,\"\")","v":""},null,null,null,null,null,null,null,null,null,null,null,null,null,null,null,null,null,null,null,null,0]
[null,null,{"$f":"IF(NOT('Eval 4'!G6=\"\"),'Eval 4'!F6,\"\")","v":""},null,null,null,null,null,null,null,null,null,null,null,null,null,null,null,null,null,null,null,null,0]
[null,null,{"$f":"IF(NOT('Eval 4'!G7=\"\"),'Eval 4'!F7,\"\")","v":""},null,null,null,null,null,null,null,null,null,null,null,null,null,null,null,null,null,null,null,null,0]
[null,null,{"$f":"IF(NOT('Eval 4'!G8=\"\"),'Eval 4'!F8,\"\")","v":""},null,null,null,null,null,null,null,null,null,null,null,null,null,null,null,null,null,null,null,null,0]
[null,null,{"$f":"IF(NOT('Eval 4'!G9=\"\"),'Eval 4'!F9,\"\")","v":""},null,null,null,null,null,null,null,null,null,null,null,null,null,null,null,null,null,null,null,null,0]
[null,null,{"$f":"IF(NOT('Eval 4'!G10=\"\"),'Eval 4'!F10,\"\")","v":""},null,null,null,null,null,null,null,null,null,null,null,null,null,null,null,null,null,null,null,null,0]
[null,null,{"$f":"IF(NOT('Eval 4'!G11=\"\"),'Eval 4'!F11,\"\")","v":""},null,null,null,null,null,null,null,null,null,null,null,null,null,null,null,null,null,null,null,null,0]
[null,null,{"$f":"IF(NOT('Eval 4'!G12=\"\"),'Eval 4'!F12,\"\")","v":""},null,null,null,null,null,null,null,null,null,null,null,null,null,null,null,null,null,null,null,null,0]
[null,null,{"$f":"IF(NOT('Eval 4'!G13=\"\"),'Eval 4'!F13,\"\")","v":""},null,null,null,null,null,null,null,null,null,null,null,null,null,null,null,null,null,null,null,null,0]
[null,"Antiseptiques",{"$f":"IF(NOT('Chapitre IV'!C106=1),'PAQ type GREPHH'!C223,\"\")","v":"Rédiger valider diffuser la procédure antiseptiques"},null,null,null,null,null,null,null,null,null,null,null,null,null,null,null,null,null,null,null,null,1]
[null,null,{"$f":"IF(AND('Chapitre IV'!C106=1,NOT('Chapitre IV'!C109=1)),'PAQ type GREPHH'!C224,\"\")","v":""},null,null,null,null,null,null,null,null,null,null,null,null,null,null,null,null,null,null,null,null,0]
[null,null,{"$f":"IF(AND('Chapitre IV'!C106=1,NOT('Chapitre IV'!C111=1)),'PAQ type GREPHH'!C225,\"\")","v":""},null,null,null,null,null,null,null,null,null,null,null,null,null,null,null,null,null,null,null,null,0]
[null,null,{"$f":"IF(AND('Chapitre IV'!C106=1,NOT('Chapitre IV'!C113=1)),'PAQ type GREPHH'!C226,\"\")","v":""},null,null,null,null,null,null,null,null,null,null,null,null,null,null,null,null,null,null,null,null,0]
[null,null,{"$f":"IF(AND('Chapitre IV'!C106=1,NOT('Chapitre IV'!C115=1)),'PAQ type GREPHH'!C227,\"\")","v":""},null,null,null,null,null,null,null,null,null,null,null,null,null,null,null,null,null,null,null,null,0]
[null,null,{"$f":"IF(NOT('Chapitre IV'!C117=1),'PAQ type GREPHH'!C228,\"\")","v":"Faire le choix consensuel de 2 gammes d'antiseptiques"},null,null,null,null,null,null,null,null,null,null,null,null,null,null,null,null,null,null,null,null,1]
[null,null,{"$f":"IF(NOT('Chapitre IV'!C119=1),'PAQ type GREPHH'!C229,\"\")","v":"Intégrer la nécessité d'une prescription médicale pour l'utilisation des antiseptiques sur les plaies"},null,null,null,null,null,null,null,null,null,null,null,null,null,null,null,null,null,null,null,null,1]
[null,null,{"$f":"IF(NOT('Chapitre IV'!C121=1),'PAQ type GREPHH'!C230,\"\")","v":"Valoriser l'utilisation d'antiseptiques alcooliques"},null,null,null,null,null,null,null,null,null,null,null,null,null,null,null,null,null,null,null,null,1]
[null,null,{"$f":"IF(NOT('Chapitre IV'!C123=1),'PAQ type GREPHH'!C231,\"\")","v":"Préconiser l'antisepsie en 4 temps pour la pose de dispositifs invasifs"},null,null,null,null,null,null,null,null,null,null,null,null,null,null,null,null,null,null,null,null,1]
[null,null,{"$f":"IF(NOT('Eval 4'!G14=\"\"),'Eval 4'!F14,\"\")","v":""},null,null,null,null,null,null,null,null,null,null,null,null,null,null,null,null,null,null,null,null,0]
[null,null,{"$f":"IF(NOT('Eval 4'!G15=\"\"),'Eval 4'!F15,\"\")","v":""},null,null,null,null,null,null,null,null,null,null,null,null,null,null,null,null,null,null,null,null,0]
[null,"Précautions standard",{"$f":"IF(NOT('Chapitre IV'!C128=1),'PAQ type GREPHH'!C232,\"\")","v":"Réaliser une formation/information large sur les précautions standard auprès des professionnels de l'établissement"},null,null,null,null,null,null,null,null,null,null,null,null,null,null,null,null,null,null,null,null,1]
[null,null,{"$f":"IF(NOT('Chapitre IV'!C133=1),'PAQ type GREPHH'!C233,\"\")","v":"Valoriser la politique sur l'hygiène des mains (zéro bijou, utilisation du SHA…)"},null,null,null,null,null,null,null,null,null,null,null,null,null,null,null,null,null,null,null,null,1]
[null,null,{"$f":"IF(NOT('Chapitre IV'!C135=1),'PAQ type GREPHH'!C234,\"\")","v":"Mettre des distributeurs de SHA à disposition de tout le personnel et des usagers (flacons de poche, distributeurs muraux dans les salles à manger, salles d'animation…)"},null,null,null,null,null,null,null,null,null,null,null,null,null,null,null,null,null,null,null,null,1]
[null,null,{"$f":"IF(NOT('Chapitre IV'!C137=1),'PAQ type GREPHH'!C235,\"\")","v":"Faire une information sur l'utilisation du SHA"},null,null,null,null,null,null,null,null,null,null,null,null,null,null,null,null,null,null,null,null,1]
[null,null,{"$f":"IF(NOT('Chapitre IV'!C140=1),'PAQ type GREPHH'!C236,\"\")","v":"Mettre en place des distributeurs d'essuie-mains à chaque poste de lavage des mains"},null,null,null,null,null,null,null,null,null,null,null,null,null,null,null,null,null,null,null,null,1]
[null,null,{"$f":"IF(NOT('Chapitre IV'!C142=1),'PAQ type GREPHH'!C237,\"\")","v":"Mettre en place des distributeurs de savon doux liquide à chaque poste de lavage des mains"},null,null,null,null,null,null,null,null,null,null,null,null,null,null,null,null,null,null,null,null,1]
[null,null,{"$f":"IF(NOT('Chapitre IV'!C144=1),'PAQ type GREPHH'!C238,\"\")","v":"Mettre en place une poubelle à commande non manuelle à chaque poste de lavage des mains"},null,null,null,null,null,null,null,null,null,null,null,null,null,null,null,null,null,null,null,null,1]
[null,null,{"$f":"IF(NOT('Chapitre IV'!C149=1),'PAQ type GREPHH'!C239,\"\")","v":"Mettre à la disposition des professionnels des gans non stériles à UU"},null,null,null,null,null,null,null,null,null,null,null,null,null,null,null,null,null,null,null,null,1]
[null,null,{"$f":"IF(NOT('Chapitre IV'!C151=1),'PAQ type GREPHH'!C240,\"\")","v":"Promouvoir l'utilisation de gants non poudrés"},null,null,null,null,null,null,null,null,null,null,null,null,null,null,null,null,null,null,null,null,1]
[null,null,{"$f":"IF(NOT('Chapitre IV'!C153=1),'PAQ type GREPHH'!C241,\"\")","v":"Promouvoir le principe UN GESTE = UNE PAIRE DE GANTS"},null,null,null,null,null,null,null,null,null,null,null,null,null,null,null,null,null,null,null,null,1]
[null,null,{"$f":"IF(NOT('Eval 4'!G16=\"\"),'Eval 4'!F16,\"\")","v":""},null,null,null,null,null,null,null,null,null,null,null,null,null,null,null,null,null,null,null,null,0]
[null,null,{"$f":"IF(NOT('Eval 4'!G17=\"\"),'Eval 4'!F17,\"\")","v":""},null,null,null,null,null,null,null,null,null,null,null,null,null,null,null,null,null,null,null,null,0]
[null,null,{"$f":"IF(NOT('Eval 4'!G18=\"\"),'Eval 4'!F18,\"\")","v":""},null,null,null,null,null,null,null,null,null,null,null,null,null,null,null,null,null,null,null,null,0]
[null,null,{"$f":"IF(NOT('Eval 4'!G19=\"\"),'Eval 4'!F19,\"\")","v":""},null,null,null,null,null,null,null,null,null,null,null,null,null,null,null,null,null,null,null,null,{"$f":"IF(OR(NOT(C328=\"\"),NOT(D328=\"\"),NOT(E328=\"\"),NOT(F328=\"\")),1,0)","v":0}]
[null,null,{"$f":"IF(NOT('Eval 4'!G20=\"\"),'Eval 4'!F20,\"\")","v":""},null,null,null,null,null,null,null,null,null,null,null,null,null,null,null,null,null,null,null,null,0]
[null,"Précautions complémentaires",{"$f":"IF(NOT('Chapitre IV'!C158=1),'PAQ type GREPHH'!C242,\"\")","v":"Faire une information sur les précautions complémentaires "},null,null,null,null,null,null,null,null,null,null,null,null,null,null,null,null,null,null,null,null,1]
[null,null,{"$f":"IF(NOT('Chapitre IV'!C162=1),'PAQ type GREPHH'!C243,\"\")","v":"Rédiger, valider et diffuser la procédure précautions complémentaires contact"},null,null,null,null,null,null,null,null,null,null,null,null,null,null,null,null,null,null,null,null,1]
[null,null,{"$f":"IF(NOT('Chapitre IV'!C164=1),'PAQ type GREPHH'!C244,\"\")","v":"Rédiger, valider et diffuser la procédure précautions complémentaires gouttelettes"},null,null,null,null,null,null,null,null,null,null,null,null,null,null,null,null,null,null,null,null,1]
[null,null,{"$f":"IF(NOT('Chapitre IV'!C166=1),'PAQ type GREPHH'!C245,\"\")","v":"Rédiger, valider et diffuser la procédure précautions complémentaires air"},null,null,null,null,null,null,null,null,null,null,null,null,null,null,null,null,null,null,null,null,1]
[null,null,{"$f":"IF(NOT('Chapitre IV'!C168=1),'PAQ type GREPHH'!C246,\"\")","v":"Inventer en équipe une signalisation non stigmatisante pour permettre aux soignants et aux familles de repérer le fait qu'il faille  prendre des précautions d'hygiène"},null,null,null,null,null,null,null,null,null,null,null,null,null,null,null,null,null,null,null,null,1]
[null,null,{"$f":"IF(NOT('Eval 4'!G21=\"\"),'Eval 4'!F21,\"\")","v":""},null,null,null,null,null,null,null,null,null,null,null,null,null,null,null,null,null,null,null,null,0]
[null,null,{"$f":"IF(NOT('Eval 4'!G22=\"\"),'Eval 4'!F22,\"\")","v":""},null,null,null,null,null,null,null,null,null,null,null,null,null,null,null,null,null,null,null,null,0]
[null,null,{"$f":"IF(NOT('Eval 4'!G23=\"\"),'Eval 4'!F23,\"\")","v":""},null,null,null,null,null,null,null,null,null,null,null,null,null,null,null,null,null,null,null,null,0]
[null,null,{"$f":"IF(NOT('Eval 4'!G24=\"\"),'Eval 4'!F24,\"\")","v":""},null,null,null,null,null,null,null,null,null,null,null,null,null,null,null,null,null,null,null,null,0]
[null,null,{"$f":"IF(NOT('Eval 4'!G25=\"\"),'Eval 4'!F25,\"\")","v":""},null,null,null,null,null,null,null,null,null,null,null,null,null,null,null,null,null,null,null,null,0]
[null,"Hygiène des résidents",{"$f":"IF(NOT('Chapitre IV'!$C$173=1),'PAQ type GREPHH'!C247,\"\")","v":"Organiser et plannifier les toilettes et soins de nursing"},null,null,null,null,null,null,null,null,null,null,null,null,null,null,null,null,null,null,null,null,1]
[null,null,{"$f":"IF(NOT('Chapitre IV'!$C$175=1),'PAQ type GREPHH'!C248,\"\")","v":"Organiser la surveillance de l'état bucco-dentaire des résidents"},null,null,null,null,null,null,null,null,null,null,null,null,null,null,null,null,null,null,null,null,1]
[null,null,{"$f":"IF(NOT('Chapitre IV'!$C$177=1),'PAQ type GREPHH'!C249,\"\")","v":"Organiser la mise en œuvre de l'hygiène des mains aux résidents (avant les repas, ou les activités collectives…)"},null,null,null,null,null,null,null,null,null,null,null,null,null,null,null,null,null,null,null,null,1]
[null,null,{"$f":"IF(NOT('Eval 4'!G26=\"\"),'Eval 4'!F26,\"\")","v":""},null,null,null,null,null,null,null,null,null,null,null,null,null,null,null,null,null,null,null,null,0]
[null,null,{"$f":"IF(NOT('Eval 4'!G27=\"\"),'Eval 4'!F27,\"\")","v":""},null,null,null,null,null,null,null,null,null,null,null,null,null,null,null,null,null,null,null,null,0]
["Chapitre","Thèmes","Axes d'amélioration","Priorité",null,null,"Responsable","Moyens",{"$f":"I262","v":2021},null,null,null,"Objectif atteint O/N/EC",{"$f":"I345+1","v":2022},null,null,null,"Objectif atteint O/N/EC",{"$f":"N345+1","v":2023},null,null,null,"Objectif atteint O/N/EC",1]
[null,null,null,"H","M","F",null,null,"1er ","2eme","3eme","4eme",null,"1er","2eme","3eme","4eme",null,"1er","2eme","3eme","4eme",null,1]
["5- Les vaccinations contre les affections respiratoires","Vaccin anti grippal et anti pneumococcique",{"$f":"IF(NOT('Chapitre V'!C8=1),'PAQ type GREPHH'!C250,\"\")","v":"Organiser la vaccination antigrippale des résidents"},null,null,null,null,null,null,null,null,null,null,null,null,null,null,null,null,null,null,null,null,{"$f":"IF(OR(NOT(C347=\"\"),NOT(D347=\"\"),NOT(E347=\"\"),NOT(F347=\"\")),1,0)","v":1}]
[null,null,{"$f":"IF(NOT('Chapitre V'!C10=1),'PAQ type GREPHH'!C251,\"\")","v":"Encourager la vaccination antigrippale des professionnels de la structure"},null,null,null,null,null,null,null,null,null,null,null,null,null,null,null,null,null,null,null,null,1]
[null,null,{"$f":"IF(NOT('Chapitre V'!C12=1),'PAQ type GREPHH'!C252,\"\")","v":"Prendre en charge les vaccins antigrippaux destinés aux professionnels"},null,null,null,null,null,null,null,null,null,null,null,null,null,null,null,null,null,null,null,null,1]
[null,null,{"$f":"IF(NOT('Chapitre V'!C14=1),'PAQ type GREPHH'!C253,\"\")","v":"Promouvoir la vaccination antipneumococcique des résidents (à évaluer à l'admission puis suivi des rappels)"},null,null,null,null,null,null,null,null,null,null,null,null,null,null,null,null,null,null,null,null,1]
[null,null,{"$f":"IF(NOT('Chapitre V'!C16=1),'PAQ type GREPHH'!C254,\"\")","v":"Faire suivre les professionnels par la médecine du travail, et promouvoir le rappel de la vaccination contre la coqueluche si non réalisé selon le calendrier vaccinal 2014"},null,null,null,null,null,null,null,null,null,null,null,null,null,null,null,null,null,null,null,null,1]
[null,null,{"$f":"IF(AND(OR('Chapitre V'!C20=\"\",'Chapitre V'!C24=\"\")),'PAQ type GREPHH'!C255,\"\")","v":"Faire le suivi des % de vaccination antipneumococcique et antigrippales des résidents"},null,null,null,null,null,null,null,null,null,null,null,null,null,null,null,null,null,null,null,null,1]
[null,null,{"$f":"IF('Chapitre V'!C22=\"\",'PAQ type GREPHH'!C256,\"\")","v":"Faire le suivi des % de vaccination antigrippale du personnel soignant"},null,null,null,null,null,null,null,null,null,null,null,null,null,null,null,null,null,null,null,null,1]
[null,null,{"$f":"IF('Chapitre V'!C26=\"\",'PAQ type GREPHH'!C257,\"\")","v":"Demander au médecin du travail une estimation du % de soignants à jours de leurs vaccination contre la coqueluche"},null,null,null,null,null,null,null,null,null,null,null,null,null,null,null,null,null,null,null,null,1]
[null,null,{"$f":"IF(NOT('Eval 5'!B4=\"\"),'Eval 5'!A4,\"\")","v":""},null,null,null,null,null,null,null,null,null,null,null,null,null,null,null,null,null,null,null,null,0]
[null,null,{"$f":"IF(NOT('Eval 5'!B5=\"\"),'Eval 5'!A5,\"\")","v":""},null,null,null,null,null,null,null,null,null,null,null,null,null,null,null,null,null,null,null,null,0]
[null,null,{"$f":"IF(NOT('Eval 5'!B6=\"\"),'Eval 5'!A6,\"\")","v":""},null,null,null,null,null,null,null,null,null,null,null,null,null,null,null,null,null,null,null,null,0]
[null,null,{"$f":"IF(NOT('Eval 5'!B7=\"\"),'Eval 5'!A7,\"\")","v":""},null,null,null,null,null,null,null,null,null,null,null,null,null,null,null,null,null,null,null,null,0]
[null,null,{"$f":"IF(NOT('Eval 5'!B9=\"\"),'Eval 5'!A9,\"\")","v":""},null,null,null,null,null,null,null,null,null,null,null,null,null,null,null,null,null,null,null,null,0]
[null,null,{"$f":"IF(NOT('Eval 5'!B8=\"\"),'Eval 5'!A8,\"\")","v":""},null,null,null,null,null,null,null,null,null,null,null,null,null,null,null,null,null,null,null,null,0]
["Chapitre","Thèmes","Axes d'amélioration","Priorité",null,null,"Responsable","Moyens",{"$f":"I262","v":2021},null,null,null,"Objectif atteint O/N/EC",{"$f":"I361+1","v":2022},null,null,null,"Objectif atteint O/N/EC",{"$f":"N361+1","v":2023},null,null,null,"Objectif atteint",1]
[null,null,null,"H","M","F",null,null,"1er ","2eme","3eme","4eme",null,"1er","2eme","3eme","4eme",null,"1er","2eme","3eme","4eme",null,1]
["6- Gestion des risques épidémiques  ","Gale",{"$f":"IF(NOT('Chapitre VI'!C12=1),'PAQ type GREPHH'!C258,\"\")","v":"Rédiger, valider et diffuser la procédure conduite à tenir en cas de gale"},null,null,null,null,null,null,null,null,null,null,null,null,null,null,null,null,null,null,null,null,{"$f":"IF(OR(NOT(C363=\"\"),NOT(D363=\"\"),NOT(E363=\"\"),NOT(F363=\"\")),1,0)","v":1}]
[null,null,{"$f":"IF(AND('Chapitre VI'!C12=1,NOT('Chapitre VI'!C15=1)),'PAQ type GREPHH'!C259,\"\")","v":""},null,null,null,null,null,null,null,null,null,null,null,null,null,null,null,null,null,null,null,null,0]
[null,null,{"$f":"IF(AND('Chapitre VI'!C12=1,NOT('Chapitre VI'!C17=1)),'PAQ type GREPHH'!C260,\"\")","v":""},null,null,null,null,null,null,null,null,null,null,null,null,null,null,null,null,null,null,null,null,0]
[null,null,{"$f":"IF(AND('Chapitre VI'!C12=1,NOT('Chapitre VI'!C19=1)),'PAQ type GREPHH'!C261,\"\")","v":""},null,null,null,null,null,null,null,null,null,null,null,null,null,null,null,null,null,null,null,null,0]
[null,null,{"$f":"IF(NOT('Chapitre VI'!C21=1),'PAQ type GREPHH'!C262,\"\")","v":"Prendre contact auprès du pharmacien pour avoir la possibilité de prescrire de l'Ivermectine dans la structure"},null,null,null,null,null,null,null,null,null,null,null,null,null,null,null,null,null,null,null,null,1]
[null,null,{"$f":"IF(NOT('Chapitre VI'!C23=1),'PAQ type GREPHH'!C263,\"\")","v":"Faire prescrire toute mise en précaution complémentaire d'hygiène  par les médecins traitants avec consignes de levées des mesures "},null,null,null,null,null,null,null,null,null,null,null,null,null,null,null,null,null,null,null,null,1]
[null,null,{"$f":"IF(NOT('Chapitre VI'!C25=1),'PAQ type GREPHH'!C264,\"\")","v":"Prévoir un isolement géographique jusqu'à 48 à 72h après le début du traitement curatif en cas de gale"},null,null,null,null,null,null,null,null,null,null,null,null,null,null,null,null,null,null,null,null,1]
[null,null,{"$f":"IF(NOT('Chapitre VI'!C27=1),'PAQ type GREPHH'!C265,\"\")","v":"Vérifier la possibilité d'acquérir des anti-acariens pour le traitement du linge ou mobilier "},null,null,null,null,null,null,null,null,null,null,null,null,null,null,null,null,null,null,null,null,1]
[null,null,{"$f":"IF(NOT('Chapitre VI'!C29=1),'PAQ type GREPHH'!C266,\"\")","v":"Prévoir une procédure et une traçabilité pour l'information donnée au résident et à sa famille concernant les suspicions ou cas de gale"},null,null,null,null,null,null,null,null,null,null,null,null,null,null,null,null,null,null,null,null,1]
[null,null,{"$f":"IF(NOT('Chapitre VI'!C31=1),'PAQ type GREPHH'!C267,\"\")","v":"Intégrer dans la procédure la nécessité de consigner dans le dossier du résident le cas de gale"},null,null,null,null,null,null,null,null,null,null,null,null,null,null,null,null,null,null,null,null,1]
[null,null,{"$f":"IF(NOT('Eval 6'!G15=\"\"),'Eval 6'!F15,\"\")","v":""},null,null,null,null,null,null,null,null,null,null,null,null,null,null,null,null,null,null,null,null,0]
[null,null,{"$f":"IF(NOT('Eval 6'!G16=\"\"),'Eval 6'!F16,\"\")","v":""},null,null,null,null,null,null,null,null,null,null,null,null,null,null,null,null,null,null,null,null,0]
[null,null,{"$f":"IF(NOT('Eval 6'!G17=\"\"),'Eval 6'!F17,\"\")","v":""},null,null,null,null,null,null,null,null,null,null,null,null,null,null,null,null,null,null,null,null,0]
[null,"Tuberculose ",{"$f":"IF(NOT('Chapitre VI'!C36=1),'PAQ type GREPHH'!C268,\"\")","v":"Rédiger, valider, diffuser la procédure conduite à tenir en cas de Tuberculose"},null,null,null,null,null,null,null,null,null,null,null,null,null,null,null,null,null,null,null,null,1]
[null,null,{"$f":"IF(NOT('Chapitre VI'!C39=1),'PAQ type GREPHH'!C269,\"\")","v":"Ecrire le protocole CAT en cas de Tuberculose"},null,null,null,null,null,null,null,null,null,null,null,null,null,null,null,null,null,null,null,null,1]
[null,null,{"$f":"IF(NOT('Chapitre VI'!C41=1),'PAQ type GREPHH'!C270,\"\")","v":"Valider le protocole CAT en cas de Tuberculose"},null,null,null,null,null,null,null,null,null,null,null,null,null,null,null,null,null,null,null,null,1]
[null,null,{"$f":"IF(NOT('Chapitre VI'!C43=1),'PAQ type GREPHH'!C271,\"\")","v":"Diffuser le protocole CAT en cas de Tuberculose"},null,null,null,null,null,null,null,null,null,null,null,null,null,null,null,null,null,null,null,null,1]
[null,null,{"$f":"IF(NOT('Chapitre VI'!C45=1),'PAQ type GREPHH'!C272,\"\")","v":"Prévoir une déclaration obligatoire auprès de la CVGAS de l'ARS en cas de Tuberculose"},null,null,null,null,null,null,null,null,null,null,null,null,null,null,null,null,null,null,null,null,1]
[null,null,{"$f":"IF(NOT('Chapitre VI'!C47=1),'PAQ type GREPHH'!C273,\"\")","v":"Identifier le CLAT"},null,null,null,null,null,null,null,null,null,null,null,null,null,null,null,null,null,null,null,null,1]
[null,null,{"$f":"IF(NOT('Chapitre VI'!C49=1),'PAQ type GREPHH'!C274,\"\")","v":"Prévoir une information systématique auprès du médecin du travail"},null,null,null,null,null,null,null,null,null,null,null,null,null,null,null,null,null,null,null,null,1]
[null,null,{"$f":"IF(NOT('Chapitre VI'!C51=1),'PAQ type GREPHH'!C275,\"\")","v":"Prévoir un avis spécialisé en cas de suspicion de tuberculose"},null,null,null,null,null,null,null,null,null,null,null,null,null,null,null,null,null,null,null,null,1]
[null,null,{"$f":"IF(NOT('Chapitre VI'!C53=1),'PAQ type GREPHH'!C276,\"\")","v":"Prévoir une hospitalisation en médecine en cas de suspicion de tuberculose"},null,null,null,null,null,null,null,null,null,null,null,null,null,null,null,null,null,null,null,null,1]
[null,null,{"$f":"IF(NOT('Chapitre VI'!C55=1),'PAQ type GREPHH'!C277,\"\")","v":"Prévoir des mesure de dépistage concernant les autres résidents"},null,null,null,null,null,null,null,null,null,null,null,null,null,null,null,null,null,null,null,null,1]
[null,null,{"$f":"IF(NOT('Chapitre VI'!C57=1),'PAQ type GREPHH'!C278,\"\")","v":"Prévoir la mise en place des précautions complémentaires AIR en attente du transfert"},null,null,null,null,null,null,null,null,null,null,null,null,null,null,null,null,null,null,null,null,1]
[null,null,{"$f":"IF(AND('Chapitre VI'!C57=1,NOT('Chapitre VI'!C59=1)),'PAQ type GREPHH'!C279,\"\")","v":""},null,null,null,null,null,null,null,null,null,null,null,null,null,null,null,null,null,null,null,null,0]
[null,null,{"$f":"IF(AND('Chapitre VI'!C57=1,NOT('Chapitre VI'!C61=1)),'PAQ type GREPHH'!C280,\"\")","v":""},null,null,null,null,null,null,null,null,null,null,null,null,null,null,null,null,null,null,null,null,0]
[null,null,{"$f":"IF(NOT('Eval 6'!G12=\"\"),'Eval 6'!F12,\"\")","v":""},null,null,null,null,null,null,null,null,null,null,null,null,null,null,null,null,null,null,null,null,0]
[null,null,{"$f":"IF(NOT('Eval 6'!G13=\"\"),'Eval 6'!F13,\"\")","v":""},null,null,null,null,null,null,null,null,null,null,null,null,null,null,null,null,null,null,null,null,0]
[null,null,{"$f":"IF(NOT('Eval 6'!G14=\"\"),'Eval 6'!F14,\"\")","v":""},null,null,null,null,null,null,null,null,null,null,null,null,null,null,null,null,null,null,null,null,0]
[null,"Gastro entérite",{"$f":"IF(NOT('Chapitre VI'!C66=1),'PAQ type GREPHH'!C281,\"\")","v":"Rédiger, valider, diffuser la procédure conduite à tenir en cas d'épidémie de GEA à partir de 3 cas"},null,null,null,null,null,null,null,null,null,null,null,null,null,null,null,null,null,null,null,null,1]
[null,null,{"$f":"IF(NOT('Chapitre VI'!C69=1),'PAQ type GREPHH'!C282,\"\")","v":"Ecrire le protocole CAT en cas d'épidémie de GEA à partir de 3 cas"},null,null,null,null,null,null,null,null,null,null,null,null,null,null,null,null,null,null,null,null,1]
[null,null,{"$f":"IF(NOT('Chapitre VI'!C71=1),'PAQ type GREPHH'!C283,\"\")","v":"Valider le protocole CAT en cas d'épidémie de GEA"},null,null,null,null,null,null,null,null,null,null,null,null,null,null,null,null,null,null,null,null,1]
[null,null,{"$f":"IF(NOT('Chapitre VI'!C73=1),'PAQ type GREPHH'!C284,\"\")","v":"Diffuser le protocole CAT en cas d'épidémie de GEA"},null,null,null,null,null,null,null,null,null,null,null,null,null,null,null,null,null,null,null,null,1]
[null,null,{"$f":"IF(NOT('Chapitre VI'!C75=1),'PAQ type GREPHH'!C285,\"\")","v":"Prévoir la mise en place de précautions complémentaires contact en cas de GEA"},null,null,null,null,null,null,null,null,null,null,null,null,null,null,null,null,null,null,null,null,1]
[null,null,{"$f":"IF(NOT('Chapitre VI'!C78=1),'PAQ type GREPHH'!C286,\"\")","v":"Prévoir le maintien en chambre des résidents suspects d'infection à clostridium difficile"},null,null,null,null,null,null,null,null,null,null,null,null,null,null,null,null,null,null,null,null,1]
[null,null,{"$f":"IF(NOT('Chapitre VI'!C80=1),'PAQ type GREPHH'!C287,\"\")","v":"Prévoir le traitement des locaux en trois temps avec de l'eau de Javel diluée au 1/5ème en cas de suspicion d'infection à clostridium difficile"},null,null,null,null,null,null,null,null,null,null,null,null,null,null,null,null,null,null,null,null,1]
[null,null,{"$f":"IF(NOT('Chapitre VI'!C84=1),'PAQ type GREPHH'!C288,\"\")","v":"Intégrer au plan de maitrise d'épidémie l'information des résidents en cas d'épidémie de GEA"},null,null,null,null,null,null,null,null,null,null,null,null,null,null,null,null,null,null,null,null,1]
[null,null,{"$f":"IF(NOT('Chapitre VI'!C86=1),'PAQ type GREPHH'!C289,\"\")","v":"Intégrer au plan de maitrise d'épidémie l'information du conseil de la vie sociale en cas d'épidémie de GEA"},null,null,null,null,null,null,null,null,null,null,null,null,null,null,null,null,null,null,null,null,1]
[null,null,{"$f":"IF(NOT('Chapitre VI'!C88=1),'PAQ type GREPHH'!C290,\"\")","v":"Intégrer au plan de maitrise d'épidémie l'information des salariés en cas d'épidémie de GEA"},null,null,null,null,null,null,null,null,null,null,null,null,null,null,null,null,null,null,null,null,1]
[null,null,{"$f":"IF(NOT('Chapitre VI'!C90=1),'PAQ type GREPHH'!C291,\"\")","v":"Intégrer au plan de maitrise d'épidémie l'information des familles en cas d'épidémie de GEA"},null,null,null,null,null,null,null,null,null,null,null,null,null,null,null,null,null,null,null,null,1]
[null,null,{"$f":"IF(NOT('Eval 6'!G4=\"\"),'Eval 6'!F4,\"\")","v":""},null,null,null,null,null,null,null,null,null,null,null,null,null,null,null,null,null,null,null,null,0]
[null,null,{"$f":"IF(NOT('Eval 6'!G5=\"\"),'Eval 6'!F5,\"\")","v":""},null,null,null,null,null,null,null,null,null,null,null,null,null,null,null,null,null,null,null,null,0]
[null,null,{"$f":"IF(NOT('Eval 6'!G6=\"\"),'Eval 6'!F6,\"\")","v":""},null,null,null,null,null,null,null,null,null,null,null,null,null,null,null,null,null,null,null,null,0]
[null,null,{"$f":"IF(NOT('Eval 6'!G7=\"\"),'Eval 6'!F7,\"\")","v":""},null,null,null,null,null,null,null,null,null,null,null,null,null,null,null,null,null,null,null,null,0]
[null,null,{"$f":"IF(NOT('Eval 6'!G8=\"\"),'Eval 6'!F8,\"\")","v":""},null,null,null,null,null,null,null,null,null,null,null,null,null,null,null,null,null,null,null,null,0]
[null,"Infection respiratoire aiguë basse",{"$f":"IF(NOT('Chapitre VI'!C95=1),'PAQ type GREPHH'!C292,\"\")","v":"Rédiger, valider et diffuser une conduite à tenir pour la prise en charge des résidents atteints d'infection respiratoire aigue basse"},null,null,null,null,null,null,null,null,null,null,null,null,null,null,null,null,null,null,null,null,1]
[null,null,{"$f":"IF(AND('Chapitre VI'!C95=1,NOT('Chapitre VI'!C98=1)),'PAQ type GREPHH'!C293,\"\")","v":""},null,null,null,null,null,null,null,null,null,null,null,null,null,null,null,null,null,null,null,null,0]
[null,null,{"$f":"IF(AND('Chapitre VI'!C95=1,NOT('Chapitre VI'!C100=1)),'PAQ type GREPHH'!C294,\"\")","v":""},null,null,null,null,null,null,null,null,null,null,null,null,null,null,null,null,null,null,null,null,0]
[null,null,{"$f":"IF(AND('Chapitre VI'!C95=1,NOT('Chapitre VI'!C102=1)),'PAQ type GREPHH'!C295,\"\")","v":""},null,null,null,null,null,null,null,null,null,null,null,null,null,null,null,null,null,null,null,null,0]
[null,null,{"$f":"IF(NOT('Chapitre VI'!C104=1),'PAQ type GREPHH'!C296,\"\")","v":"Inclure dans la procédure la mise en précautions complémentaires gouttelettes du résident atteind d'IRA"},null,null,null,null,null,null,null,null,null,null,null,null,null,null,null,null,null,null,null,null,1]
[null,null,{"$f":"IF(NOT('Chapitre VI'!C106=1),'PAQ type GREPHH'!C297,\"\")","v":"Inclure dans la procédure l'utilisation de masques chirurgicaux pour les professionnels prenant en charge un résident atteint d'IRA"},null,null,null,null,null,null,null,null,null,null,null,null,null,null,null,null,null,null,null,null,1]
[null,null,{"$f":"IF(NOT('Chapitre VI'!C108=1),'PAQ type GREPHH'!C298,\"\")","v":"Inclure dans la procédure l'utilisation de masques chirurgicaux pour les résidents atteints d'IRA sortant de leur chambre"},null,null,null,null,null,null,null,null,null,null,null,null,null,null,null,null,null,null,null,null,1]
[null,null,{"$f":"IF(NOT('Chapitre VI'!C110=1),'PAQ type GREPHH'!C299,\"\")","v":"Inclure dans la procédure l'interruption provisoire des activités collectives pour les résidents atteints d'IRA "},null,null,null,null,null,null,null,null,null,null,null,null,null,null,null,null,null,null,null,null,1]
[null,null,{"$f":"IF(NOT('Eval 6'!G9=\"\"),'Eval 6'!F9,\"\")","v":""},null,null,null,null,null,null,null,null,null,null,null,null,null,null,null,null,null,null,null,null,0]
[null,null,{"$f":"IF(NOT('Eval 6'!G10=\"\"),'Eval 6'!F10,\"\")","v":""},null,null,null,null,null,null,null,null,null,null,null,null,null,null,null,null,null,null,null,null,0]
[null,null,{"$f":"IF(NOT('Eval 6'!G11=\"\"),'Eval 6'!F11,\"\")","v":""},null,null,null,null,null,null,null,null,null,null,null,null,null,null,null,null,null,null,null,null,0]
[null,"Plan de maitrise d'une épidémie",{"$f":"IF(NOT('Eval 6'!G18=\"\"),'Eval 6'!F18,\"\")","v":""},null,null,null,null,null,null,null,null,null,null,null,null,null,null,null,null,null,null,null,null,0]
[null,null,{"$f":"IF(NOT('Eval 6'!G19=\"\"),'Eval 6'!F19,\"\")","v":""},null,null,null,null,null,null,null,null,null,null,null,null,null,null,null,null,null,null,null,null,0]
[null,null,{"$f":"IF(NOT('Eval 6'!G20=\"\"),'Eval 6'!F20,\"\")","v":""},null,null,null,null,null,null,null,null,null,null,null,null,null,null,null,null,null,null,null,null,0]
[null,null,{"$f":"IF(NOT('Eval 6'!G21=\"\"),'Eval 6'!F21,\"\")","v":""},null,null,null,null,null,null,null,null,null,null,null,null,null,null,null,null,null,null,null,null,0]
[null,null,{"$f":"IF(NOT('Eval 6'!G22=\"\"),'Eval 6'!F22,\"\")","v":""},null,null,null,null,null,null,null,null,null,null,null,null,null,null,null,null,null,null,null,null,0]
[null,null,{"$f":"IF(NOT('Eval 6'!G23=\"\"),'Eval 6'!F23,\"\")","v":""},null,null,null,null,null,null,null,null,null,null,null,null,null,null,null,null,null,null,null,null,0]
[null,null,{"$f":"IF(NOT('Eval 6'!G24=\"\"),'Eval 6'!F24,\"\")","v":""},null,null,null,null,null,null,null,null,null,null,null,null,null,null,null,null,null,null,null,null,0]
["Chapitre","Thèmes","Axes d'amélioration","Priorité",null,null,"Responsable","Moyens",{"$f":"I361","v":2021},null,null,null,"Objectif atteint O/N/EC",{"$f":"I426+1","v":2022},null,null,null,"Objectif atteint O/N/EC",{"$f":"N426+1","v":2023},null,null,null,"Objectif atteint O/N/EC",1]
[null,null,null,"H","M","F",null,null,"1er ","2eme","3eme","4eme",null,"1er","2eme","3eme","4eme",null,"1er","2eme","3eme","4eme",null,{"$f":"IF(OR(NOT(C427=\"\"),NOT(D427=\"\"),NOT(E427=\"\"),NOT(F427=\"\")),1,0)","v":1}]
["7- Prévention des accidents avec exposition au sang ","AES ",{"$f":"IF(NOT('Chapitre VII'!C10=1),'PAQ type GREPHH'!C300,\"\")","v":"Vérifier auprès du médecin du travail que les soignants sont à jour concernant leur vaccination VHB"},null,null,null,null,null,null,null,null,null,null,null,null,null,null,null,null,null,null,null,null,{"$f":"IF(OR(NOT(C428=\"\"),NOT(D428=\"\"),NOT(E428=\"\"),NOT(F428=\"\")),1,0)","v":1}]
[null,null,{"$f":"IF(NOT('Chapitre VII'!C12=1),'PAQ type GREPHH'!C301,\"\")","v":"Prévoir une formation sur les AES pour les soignants salariés et les personnels extérieurs"},null,null,null,null,null,null,null,null,null,null,null,null,null,null,null,null,null,null,null,null,1]
[null,null,{"$f":"IF(NOT('Chapitre VII'!C14=1),'PAQ type GREPHH'!C302,\"\")","v":"Rédiger valider diffuser la procédure CAT en cas d'AES"},null,null,null,null,null,null,null,null,null,null,null,null,null,null,null,null,null,null,null,null,1]
[null,null,{"$f":"IF(AND('Chapitre VII'!C14=1,NOT('Chapitre VII'!C17=1)),'PAQ type GREPHH'!C303,\"\")","v":""},null,null,null,null,null,null,null,null,null,null,null,null,null,null,null,null,null,null,null,null,0]
[null,null,{"$f":"IF(AND('Chapitre VII'!C14=1,NOT('Chapitre VII'!C19=1)),'PAQ type GREPHH'!C304,\"\")","v":""},null,null,null,null,null,null,null,null,null,null,null,null,null,null,null,null,null,null,null,null,0]
[null,null,{"$f":"IF(NOT('Chapitre VII'!C21=1),'PAQ type GREPHH'!C305,\"\")","v":"Afficher la CAT en cas d'AES dans les lieux communs du personnel et des intervenants (salle de soins...)"},null,null,null,null,null,null,null,null,null,null,null,null,null,null,null,null,null,null,null,null,1]
[null,null,{"$f":"IF(NOT('Chapitre VII'!C23=1),'PAQ type GREPHH'!C306,\"\")","v":"Prévoir de faire un test rapide de dépistage VIH du résident source avec son accord ou celui de sa personne de confiance ou de son référent familial"},null,null,null,null,null,null,null,null,null,null,null,null,null,null,null,null,null,null,null,null,1]
[null,null,{"$f":"IF(NOT('Chapitre VII'!C25=1),'PAQ type GREPHH'!C307,\"\")","v":"Réaliser un suivi des AES en lien avec le médecin du travail"},null,null,null,null,null,null,null,null,null,null,null,null,null,null,null,null,null,null,null,null,1]
[null,null,{"$f":"IF(OR('Chapitre VII'!C27=4,'Chapitre VII'!C27=1),'PAQ type GREPHH'!C308,\"\")","v":""},null,null,null,null,null,null,null,null,null,null,null,null,null,null,null,null,null,null,null,null,0]
[null,null,{"$f":"IF(OR('Chapitre VII'!C29=1,'Chapitre VII'!C29=3),\"\",'PAQ type GREPHH'!C309)","v":"Présenter le suivi des AES en CHSCT"},null,null,null,null,null,null,null,null,null,null,null,null,null,null,null,null,null,null,null,null,1]
[null,null,{"$f":"IF(NOT('Chapitre VII'!C33=1),'PAQ type GREPHH'!C310,\"\")","v":"Fournir des gants non stériles UU aux professionnels"},null,null,null,null,null,null,null,null,null,null,null,null,null,null,null,null,null,null,null,null,1]
[null,null,{"$f":"IF(NOT('Chapitre VII'!C35=1),'PAQ type GREPHH'!C311,\"\")","v":"Fournir des masques chirurgicaux aux professionnels"},null,null,null,null,null,null,null,null,null,null,null,null,null,null,null,null,null,null,null,null,1]
[null,null,{"$f":"IF(NOT('Chapitre VII'!C37=1),'PAQ type GREPHH'!C312,\"\")","v":"Fournir des lunettes de protection aux professionnels"},null,null,null,null,null,null,null,null,null,null,null,null,null,null,null,null,null,null,null,null,1]
[null,null,{"$f":"IF(NOT('Chapitre VII'!C41=1),'PAQ type GREPHH'!C313,\"\")","v":"Fournir des collecteurs OPCT munis de fixation aux professionnels"},null,null,null,null,null,null,null,null,null,null,null,null,null,null,null,null,null,null,null,null,1]
[null,null,{"$f":"IF(OR('Chapitre VII'!C43=2, 'Chapitre VII'!C43=\"\"),'PAQ type GREPHH'!C314,\"\")","v":"Fournir du matériel sécurisé pour les prélèvements sanguins aux professionnels"},null,null,null,null,null,null,null,null,null,null,null,null,null,null,null,null,null,null,null,null,1]
[null,null,{"$f":"IF(OR('Chapitre VII'!C45=2,'Chapitre VII'!C45=\"\"),'PAQ type GREPHH'!C315,\"\")","v":"Fournir du matériel sécurisé pour les prélèvements capillaires aux professionnels"},null,null,null,null,null,null,null,null,null,null,null,null,null,null,null,null,null,null,null,null,1]
[null,null,{"$f":"IF(OR('Chapitre VII'!C47=2,'Chapitre VII'!C47=\"\"),'PAQ type GREPHH'!C316,\"\")","v":"Fournir du matériel sécurisé pour les injections aux professionnels"},null,null,null,null,null,null,null,null,null,null,null,null,null,null,null,null,null,null,null,null,1]
[null,null,{"$f":"IF(OR('Chapitre VII'!C49=2,'Chapitre VII'!C49=\"\"),'PAQ type GREPHH'!C317,\"\")","v":"Fournir du matériel sécurisé pour les perfusions veineuses aux professionnels"},null,null,null,null,null,null,null,null,null,null,null,null,null,null,null,null,null,null,null,null,1]
[null,null,{"$f":"IF(OR('Chapitre VII'!C51=2,'Chapitre VII'!C51=\"\"),'PAQ type GREPHH'!C318,\"\")","v":"Fournir du matériel sécurisé pour les perfusions sous cutanées aux professionnels"},null,null,null,null,null,null,null,null,null,null,null,null,null,null,null,null,null,null,null,null,1]
[null,null,{"$f":"IF(OR('Chapitre VII'!C53=2,'Chapitre VII'!C53=\"\"),'PAQ type GREPHH'!C319,\"\")","v":"Fournir du matériel sécurisé pour l'insulinothérapie par autopiqueur aux professionnels"},null,null,null,null,null,null,null,null,null,null,null,null,null,null,null,null,null,null,null,null,1]
[null,null,{"$f":"IF(NOT('Eval 7'!G4=\"\"),'Eval 7'!F4,\"\")","v":""},null,null,null,null,null,null,null,null,null,null,null,null,null,null,null,null,null,null,null,null,0]
[null,null,{"$f":"IF(NOT('Eval 7'!G5=\"\"),'Eval 7'!F5,\"\")","v":""},null,null,null,null,null,null,null,null,null,null,null,null,null,null,null,null,null,null,null,null,0]
[null,null,{"$f":"IF(NOT('Eval 7'!G6=\"\"),'Eval 7'!F6,\"\")","v":""},null,null,null,null,null,null,null,null,null,null,null,null,null,null,null,null,null,null,null,null,0]
[null,null,{"$f":"IF(NOT('Eval 7'!G7=\"\"),'Eval 7'!F7,\"\")","v":""},null,null,null,null,null,null,null,null,null,null,null,null,null,null,null,null,null,null,null,null,0]
[null,null,{"$f":"IF(NOT('Eval 7'!G8=\"\"),'Eval 7'!F8,\"\")","v":""},null,null,null,null,null,null,null,null,null,null,null,null,null,null,null,null,null,null,null,null,0]
[null,null,null,"NOTES:"]
[]
["   "]

{"sheet":"Protocoles","index":45,"n_rows":169,"n_cols":7,"rows_kept":169,"cut":false,"hidden":false,"merged":[[14,4,14,5],[15,0,16,1],[15,2,16,2],[15,3,16,3],[18,3,19,3],[22,0,22,6],[26,0,26,1],[24,0,24,6],[27,6,28,6],[26,4,26,5],[30,6,31,6],[0,0,0,6],[20,0,20,1],[136,0,136,2],[119,0,119,2],[120,0,120,2],[121,0,121,2],[89,0,89,2],[90,0,90,2],[91,0,91,2],[92,0,92,2],[27,2,28,2],[30,2,31,2],[3,0,3,6],[4,0,4,6],[5,0,5,6],[6,0,6,6],[12,0,12,6],[14,0,14,1],[36,0,36,1],[36,4,36,5],[29,0,29,1],[30,0,31,1],[32,0,32,1],[33,0,33,1],[27,4,28,5],[29,4,29,5],[30,4,31,5],[32,4,32,5],[33,4,33,5],[27,0,28,1],[27,3,28,3],[30,3,31,3],[35,0,35,1],[35,4,35,5],[34,0,34,1],[34,4,34,5],[49,0,49,2],[50,0,50,2],[51,0,51,2],[52,0,52,2],[53,0,53,2],[54,0,54,2],[55,0,55,2],[48,0,48,2],[38,0,38,6],[40,0,40,6],[69,0,69,6],[71,0,71,2],[73,0,73,2],[72,0,72,2],[74,0,74,2],[56,0,56,2],[57,0,57,2],[58,0,58,2],[59,0,59,2],[60,0,60,2],[61,0,61,2],[64,0,64,2],[65,0,65,2],[62,0,62,2],[63,0,63,2],[85,0,85,6],[86,0,86,2],[87,0,87,2],[88,0,88,2],[81,0,81,2],[83,0,83,6],[75,0,75,2],[76,0,76,2],[77,0,77,2],[78,0,78,2],[79,0,79,2],[80,0,80,2],[104,0,104,2],[105,0,105,2],[106,0,106,2],[93,0,93,2],[94,0,94,2],[95,0,95,2],[98,0,98,6],[100,0,100,6],[102,0,102,6],[123,0,123,6],[125,0,125,6],[127,0,127,2],[115,0,115,2],[116,0,116,2],[117,0,117,2],[118,0,118,2],[107,0,107,2],[108,0,108,2],[109,0,109,2],[110,0,110,2],[111,0,111,2],[113,0,113,6],[152,0,152,2],[153,0,153,2],[144,0,144,2],[145,0,145,2],[128,0,128,2],[129,0,129,2],[131,0,131,6],[133,0,133,6],[135,0,135,2],[138,0,138,2],[139,0,139,2],[140,0,140,2],[141,0,141,2],[142,0,142,2],[143,0,143,2],[137,0,137,2],[8,0,8,6],[20,4,20,5],[164,0,164,6],[159,0,159,2],[166,0,166,2],[167,0,167,2],[168,0,168,2],[15,4,16,5],[15,6,16,6],[17,0,17,1],[17,4,17,5],[18,0,19,1],[18,2,19,2],[18,4,19,5],[18,6,19,6],[157,0,157,2],[158,0,158,2],[146,0,146,2],[147,0,147,2],[148,0,148,2],[149,0,149,2],[150,0,150,2],[151,0,151,2],[155,0,155,6]]}
["Extrait du \"guide d'aide à l'élaboration du DARI\" ARS DT 91, 2012"]
[]
[]
["L’ensemble des protocoles de prévention en hygiène doivent être centralisés dans un même support. Les références de chaque protocole doivent être insérées au sein du DARI afin d’être retrouver de façon efficiente. "]
["L’élaboration de ces protocoles doit s’appuyer sur les référentiels en la matière. Après rédaction et validation, l’établissement organisera la diffusion des protocoles (réunions, groupe de travail….). "]
["Ces documents devront être à disposition dans chaque poste de soins sous forme papier (classeur X) ou informatique (lien intranet)."]
["Les protocoles doivent tous être validés par le directeur et/ou le médecin coordonnateur."]
[]
[]
[]
[]
[]
["Chapitre 1.            Moyens"]
[]
["Thématiques de procédures",null,"Date de création du document","Année de mise à jour :","Personne référente du groupe de travail",null,"Nom ou codification des documents de référence"]
["Politique de prise en charge des résidents porteurs de BMR"]
["Politique Antibiotiques"]
["Protocoles de prescription des antibiotiques"]
["Liste des médicaments efficiente"]
[]
["Fiche d’évaluation de l’antibiothérapie à 48h et 72h"]
[]
["Chapitre 2.            Mesures environnementales"]
[]
["a)           Entretien des locaux"]
[]
["Thématiques de procédures",null,"Date de création du document","Année de mise à jour :","Personne référente du groupe de travail",null,"Nom ou codification des documents de référence"]
["Entretien de la chambre : quotidien, trimestriel, au départ du résident"]
[]
["Entretien des sanitaires communs"]
["Entretien des lieux de vie collectifs après chaque utilisation"]
[]
["Entretien des bureaux de consultation"]
["Entretien des lieux de soins"]
["Utilisation des détergents"]
["Liste des produits disponibles"]
["Composition et entretien du chariot de ménage"]
[]
["b)           Hygiène en restauration"]
[]
["Le plan de maîtrise sanitaire décrit les mesures prises par l’établissement pour assurer l’hygiène et la sécurité sanitaire de ses productions vis à vis des dangers biologiques, physiques et chimiques. Il comprend les éléments nécessaires à la mise en place et les preuves de l’application :"]
[]
[]
[]
[]
[]
[]
[]
["Thématiques des procédures au sein du plan de maitrise sanitaire",null,null,"Date de création du document","Date d’auto-évaluation ou vérification","Personne référente du groupe de travail","Nom ou codification des documents de référence"]
["Procédures liées à la production des repas"]
["·         Plan de nettoyage et de désinfection et plan de maintenance des locaux et équipements"]
["·         Hygiène des personnels (gants, coiffe, lavage des mains, tenue…)"]
["·         Plan de formation"]
["·         Suivi médical"]
["·         Maitrise des températures"]
["·         Traçabilité amont, aval des produits"]
["·         Contrôle des produits à réception "]
["·         Plan de lutte contre les nuisibles "]
["·         Autres…"]
["Procédures liées à la distribution des repas en chambre ou en salles à manger (avec ou sans office)"]
["Plan de nettoyage et de désinfection des matériels et équipements "]
["Hygiène des personnels (tenue, lavage des mains…)"]
["Maitrise des températures"]
["autres"]
["Procédures liées à la préparation de plats ou repas par les résidents « ateliers cuisine » notamment de type thérapeutique"]
["Conduite à tenir en cas de Toxi Infection Alimentaire Collective (TIAC)"]
[]
[]
[]
["c)           Gestion du linge"]
[]
["Thématiques de procédures",null,null,"Date de création du document","Année de mise à jour :","Personne référente du groupe de travail","Nom ou codification des documents de référence"]
["Procédure de gestion du linge sale :"]
["·         Conditionnement "]
["·         Tri "]
["·         Stockage"]
["·         Nettoyage du matériel"]
["Procédure de gestion du linge propre : "]
["Conditionnement"]
["Stockage"]
["Nettoyage du matériel"]
["Procédure d’entretien du linge :"]
[]
["d)           Gestion des déchets"]
[]
["Les déchets font l’objet d’un système de tri, d’un stockage et d’une élimination spécifiques en fonction de leur nature : Déchets Ménagers (DM), Déchets d’Activité de Soins à Risque Infectieux (DASRI), verres, emballages et déchets recyclages, autres déchets à fort impact polluant (piles, radiographies,…). (Lister les différents types de déchets faisant l’objet d’un tri sélectif)"]
["Thématiques de procédures",null,null,"Date de création du document","Année de mise à jour :","Personne référente du groupe de travail","Nom ou codification des documents de référence"]
["Procédure générale de gestion de tous les déchets"]
["Procédure de gestion des DASRI"]
["·         Tri"]
["·         Conditionnement "]
["·         Stockage (intermédiaire et/ou centralisé)"]
["·         Nettoyage"]
["·         Elimination"]
["·         Traçabilité"]
["·         Hygiène du personnel"]
[]
[]
["e)           Gestion de la qualité de l’eau"]
[]
["Préciser le lieu de classement ou/et de consultation du carnet sanitaire et de ses annexes (document papier, document informatique, site internet…)"]
[]
["Eau chaude sanitaire"]
[]
["Thématiques de procédures",null,null,"Date de création du document","Année de mise à jour :","Personne référente du groupe de travail","Nom ou codification des documents de référence"]
["Plan et cartographie des réseaux"]
["Procédures liées à la maitrise des températures (Suivi des températures en production, en distribution…)"]
["Procédures liées à lutte contre la stagnation de l’eau (purges, repérage des bras morts ou points sous utilisés…)"]
["Procédures liées à la lutte contre l’entartrage et la corrosion des installations (entretien et maintenance des équipements, détartrage, désinfection…)"]
["Procédure de la surveillance analytique des légionelles dans l’eau chaude (analyses)"]
["Procédures de gestion d’une contamination"]
["Conduite à tenir devant un cas de légionellose"]
[]
["Eau de consommation alimentaire"]
[]
["Thématiques de procédures",null,null,"Date de création du document","Année de mise à jour :","Personne référente du groupe de travail","Nom ou codification des documents de référence"]
["Procédure de contrôle de la qualité de l’eau du réseau (analyse annuelle en cuisine de préférence)"]
["Procédure de gestion des eaux embouteillées et/ou des fontaines à eau en bombonne"]
["Procédure de gestion des fontaines réfrigérées"]
["Maintenance"]
["Entretien"]
["Contrôle analytique"]
[]
["Chapitre 3.          Gestion du matériel de soins"]
[]
["Identifier tous les dispositifs médicaux de la structure et réaliser les procédures d’entretien correspondantes."]
[]
["Thématiques de procédures",null,null,"Date de création du document","Année de mise à jour :","Personne référente du groupe de travail","Nom ou codification des documents de référence"]
["Procédure de nettoyage désinfection du matériel de soins"]
["Calendrier d'entretien du matériel de soins"]
[]
["Chapitre 4.            Gestion des soins"]
[]
["a)           Actes infirmiers et de nursing"]
[]
["Thématiques de procédures",null,null,"Date de création du document","Année de mise à jour :","Personne référente du groupe de travail","Nom ou codification des documents de référence"]
["Aérosol thérapie"]
["Alimentation entérale"]
["Aspiration buccale ou bronchique"]
["Hygiène des mains et port de gants"]
["Injections IM"]
["Injections S/C"]
["Injections IV"]
["Oxygénothérapie"]
["Plaies (escarres,ulcères…)"]
["Pose d'une voie veineuse périphérique"]
["Pose d'une perfusion sous cutanée"]
["Précautions complémentaires"]
["Précautions standard"]
["Prélèvement veineux"]
["Soins de nursing (toilette, soins bucco dentaires)"]
["Sondage vésical"]
["Stomies"]
["…"]
[]
["b)           Antiseptiques"]
[]
["Thématiques de procédures",null,null,"Date de création du document","Année de mise à jour :","Personne référente du groupe de travail","Nom ou codification des documents de référence"]
["Antiseptiques"]
["Liste des antiseptiques de la structure"]
[]
[]
[]
[]
["7.            Prévention des accidents d’exposition au sang"]
[]
["Thématiques de procédures",null,null,"Date de création du document","Année de mise à jour :","Personne référente du groupe de travail","Nom ou codification des documents de référence"]
["Procédure relative aux accidents exposant au sang"]
["(1ers gestes, réalisation examen biologique, déclaration, médecin du travail)"]

{"sheet":"PAQ type GREPHH","index":46,"n_rows":319,"n_cols":3,"rows_kept":319,"cut":false,"hidden":true,"merged":[]}
[null,"OBJECTIFS","ACTIONS"]
[]
[null,"médecin coordonnateur","Embaucher un médecin coordonnateur"]
[null,null,"Passer une convention avec un établissement de santé"]
[null,"Convention EOH/EMH","Passer une convention avec une EOH/EMH/IMH"]
[null,"référent hygiène","Nommer un référent en  hygiène avec un temps dédié, et bien définir son rôle dans la structure\nInscrire le réferent à la formation Hygiène EOH/EMH/IMH"]
[null," rapport d'activité annuel","Intégrer le risque hygiène dans le rapport d'activité  du risque infectieux (cf onglet outils 1)"]
[null,"Former l'ensemble du personnel à la prévention des IAS","Organiser La formation du personnel à la prévention des IAS"]
[null,"Former l'ensemble du personnel à la prévention des IAS","Former les médecins sur l'hygiène des mains, PS, PCH, et le bon usage des antibiotiques en commission gériatrique"]
[null,"Former l'ensemble du personnel à la prévention des IAS","Programmer la formation hygiène des mains, sensibilisation à la vaccination antigrippale à l'intégralité des  soignants, et kinésithérapeutes \nProgrammer la formation gestion des excréta aux IDE et AS"]
[null,"Former l'ensemble du personnel à la prévention des IAS","Programmer une formation hygiène des mains sensibilisation à la vaccination antigrippale et gestion des excéta aux AMP"]
[null,"Former l'ensemble du personnel à la prévention des IAS","Programmer une formation hygiène des mains, bionettoyage, sensibilisation à la vaccination antigrippaleau personnel technique/logistique et veiller au suivi des formations de la méthode HACCP,  RABC…"]
[null,"Former l'ensemble du personnel à la prévention des IAS","Programmer une formation hygiène des mains, sensibilisation à la vaccination antigrippale au personnel admimnistratif"]
[null,"Surveillance/Alerte/Indicateurs","Réaliser une enquête de prévalence des IAS en EHPAD (Prev'EHPAD) en mai ou juin"]
[null,"Repérage et gestion BMR","Définir une politique de prise en charge des résidents porteurs de BMR avec signalement interne "]
[null,"Repérage et gestion BMR","Réaliser un suivi épidémiologique du nombre de résidents porteurs de BMR/BHRe dans la structure"]
[null,"NUTRITION","Organiser une évaluation nutritionnelle des résidents dans la structure"]
[null,"NUTRITION","Rédiger une CAT en cas de malnutrition ou déshydratation"]
[null,"NUTRITION","Organiser le suivi du poids des résidents de façon mensuelle"]
[null,"Presonnes ressources","Identifier les personnes ressources ARS, CIRE, CLAT, CCLIN et ARLIN (cf. onglet Plan de maitrise épidémie)"]
[null,"Presonnes ressources","Identifier les personnes ressources ARS (cf. onglet Plan de maitrise épidémie)"]
[null,"Presonnes ressources","Identifier les personnes ressources CIRE (cf. onglet Plan de maitrise épidémie)"]
[null,"Presonnes ressources","Identifier les personnes ressources CCLIN (cf. onglet Plan de maitrise épidémie)"]
[null,"Presonnes ressources","Identifier les personnes ressources  ARLIN (cf. onglet Plan de maitrise épidémie)"]
[null,"Presonnes ressources","Solliciter l'EMH à chaque phénomène épidémique ou infection à risque épidémique, "]
[null,"Antibiotiques","Définir la politique antibiotique"]
[null,"Antibiotiques","Nommer un référent Antibiotiques"]
[null,"Antibiotiques","Protocoles de prescription à mettre à disposition des médecins traitants dans le poste de soins  (kit antibiotiques, antibioclic…)"]
[null,"Antibiotiques","Organiser la réévaluation des ATB à 48-72h"]
[null,"Règlement intérieur","Mettre en place un règlement intérieur prenant en compte les items sur l'hygiène de la tenue: changement quotidien , absence de vêtement dépassant de la tenue , cheveux attachés, absence de bijoux, ongles courts et sans vernis ni faux ongles"]
[null,"Règlement intérieur","Rajouter dans le règlement intérieur le port d'une tenue professionnelle pour le salarié de l'établissement "]
[null,"Règlement intérieur","Rajouter dans le règlement intérieur la fourniture  de la tenue par l'institution"]
[null,"Règlement intérieur","Rajouter dans le règlement intérieur l'entretien  de la tenue par l'institution"]
[null,"Règlement intérieur","Rajouter dans le règlement intérieur le changement quotidien de la tenue professionnelle"]
[null,"Règlement intérieur","Rajouter dans le règlement intérieur la mise à disposition d'une tenue professionnelle pour les intervenants extérieurs (par exemple, tablier manches longues UU ou blouse entretenue par l'établissement)"]
[null,"Règlement intérieur","Rajouter dans le règlement intérieur la notion de manches courtes pour la tenue professionnelle "]
[null,"Règlement intérieur","Rajouter dans le règlement intérieur la notion d'absence de vêtement dépassant de la tenue professionnelle "]
[null,"Règlement intérieur","Rajouter dans le règlement intérieur la notion d'absence de vêtement personnel sur la tenue au cours de l'acivité de soins "]
[null,"Règlement intérieur","Rajouter dans le règlement intérieur l'obligation d'avoir les cheveux longs attachés et maintenus"]
[null,"Règlement intérieur","Rajouter dans le règlement intérieur l'obligation d'absence de bijoux (mains et poignets)"]
[null,"Règlement intérieur","Rajouter dans le règlement intérieur l'obligation d'avoir les ongles courts, sans vernis, et sans faux ongles."]
[null,"Former l'ensemble du personnel à la prévention des IAS","Formation des nouveaux embauchés par le référent hygiène"]
[null,"Entretien locaux","Rédiger valider et diffuser le protocole d'entretien des locaux"]
[null,"Entretien locaux","Faire valider le protocole entretien des locaux"]
[null,"Entretien locaux","Diffuser le protocole entretien des locaux"]
[null,"Entretien locaux","Réévaluer la procédure entretien des locaux"]
[null,"Entretien locaux","Intégrer le nettoyage quotidien de la chambre dans le calendrier d'entretien"]
[null,"Entretien locaux","Intégrer le nettoyage trimestriel approfondi de la chambre  dans le calendrier d'entretien"]
[null,"Entretien locaux","Intégrer le nettoyage approfondi de la chambre au départ du résident  dans le calendrier d'entretien"]
[null,"Entretien locaux","Intégrer le bionettoyage quotidien des sanitaires communs  dans le calendrier d'entretien"]
[null,"Entretien locaux","Intégrerle bionettoyage des lieux communs après chaque utilisation dans le calendrier d'entretien"]
[null,"Entretien locaux","Intégrer le bionettoyage du bureau de consultation après chaque utilisation  dans le calendrier d'entretien"]
[null,"Entretien locaux","Intégrer le bionettoyage quotidien de la salle de soins dans le calendrier d'entretien"]
[null,"Entretien locaux","Annexer les feuilles de traçabilité d'entretien des locaux à la procédure"]
[null,"Entretien locaux","Définir l'utilisation du détergent"]
[null,"Entretien locaux","Définir l'utilisation du détergent désinfectant"]
[null,"Entretien locaux","Définir l'utilisation du nettoyeur vapeur le cas échéant"]
[null,"Entretien locaux","Annexer la liste des produits disponible pour l'entretien des locaux à la procédure"]
[null,"Entretien locaux","Mettre à disposition du personnel un chariot de ménage adapté"]
[null,"Entretien locaux","Mettre à disposition du personnel des bandaux"]
[null,"Entretien locaux","Mettre à disposition du personnel des balais trapèzes"]
[null,"Entretien locaux","Mettre à disposition du personnel des lavettes"]
[null,"Entretien locaux","Mettre à disposition du personnel les produits détergents et détergents / désinfectants"]
[null,"Restauration","Mettre en place la méthode HACCP en restauration"]
[null,"Restauration","Contrôler la température > 63°C minimum des aliments chauds servis aux résidents"]
[null,"Restauration","Contrôler la température < 8°C des aliments froids servis aux résidents"]
[null,"Restauration","Contrôler la température à 3°C des aliments cuisinés avant remise en température"]
[null,"Restauration","Contrôler la température <8°C des aliments froids"]
[null,"Restauration","Contrôler la température à 63°C des aliments cuisinés après remise en température"]
[null,"Surveillance température du repas","Mettre à la disposition des soignants un themomètre pour le repas "]
[null,"Surveillance température des réfrigérateurs","Contrôler et tracer la température des réfrigérateurs"]
[null,"Hygiène en restauration","Rédiger valider et diffuser la conduite à tenir en cas de températures non conformes des repas et réfrigérateurs"]
[null,"Hygiène en restauration","Rédiger valider et diffuser le protocole concernant la distribution des repas en rajoutant l' hygiène des mains des agents et des résidents ainsi que la protection de la tenue pour le service"]
[null,"Hygiène en restauration","Intégrer dans le protocole concernant la distribution des repas l'hygiène des mains des agents avant le repas"]
[null,"Hygiène en restauration","Intégrer dans le protocole concernant la distribution des repas l'hygiène des mains des résidents avant le repas"]
[null,"Hygiène en restauration","Intégrer dans le protocole concernant la distribution des repas la protection de la tenue pour servir le repas"]
[null,"Circuit restauration","Rédiger, valider et diffuser le protocole d'entretien des chariots de distribution des repas et mettre en place une feuille de traçabilité"]
[null,"Circuit restauration","Rédiger, valider et diffuser le protocole d'entretien des réfrigirateurs"]
[null,"Circuit restauration","Rédiger, valider et diffuser le protocole d'entretien des micro ondes et mettre en place une feuille de traçabilité "]
[null,"Circuit restauration","Rédiger, valider et diffuser le protocole d'entretien des chauffe lait et mettre en place une feuille de traçabilité"]
[null,"Circuit restauration","Rédiger, valider et diffuser le protocole d'entretien des bouilloires et mettre en place une feuille de traçabilité"]
[null,"Circuit restauration","Rédiger une conduite à tenir en cas de dysfonctionnement des appareils électroménagers (bouilloires, chauffes laits, micro-onde, réfrigérateurs, lave vaisselle…)"]
[null,"Circuit restauration","Rédiger, valider et diffuser la procédure atelier cuisine le cas échéant"]
[null,"Procédure linge popre","Rédiger, valider et diffuser les procédures linge propre comprenant l'hygiène des mains avant toute manipulation"]
[null,"Procédure linge popre"," Valider les procédures linge propre"]
[null,"Procédure linge popre","Diffuser les procédures linge propre"]
[null,"Procédure linge popre","Réévaluer les procédures linge propre"]
[null,"Circuit linge propre","Garder le linge non filmé à l'abri des contaminations jusqu'à l'utilisation (housse, local…)"]
[null,"Circuit linge propre","Organiser le stockage du linge propre dans un chariot, armoire  ou  local fermé"]
[null,"Circuit linge propre","Mettre en œuvre l'hygiène des mains avant toute manipulation du linge propre (à inclure dans la procédure)"]
[null,"Procédure linge sale","Rédiger, valider et diffuser la procédure linge sale"]
[null,"Procédure linge sale"," Valider la procédure linge sale"]
[null,"Procédure linge sale","Diffuser la procédure linge sale"]
[null,"Procédure linge sale","Réévaluer la procédure linge sale"]
[null,"Procédure linge sale","Intégrer le tri à la production dans la procédure linge sale"]
[null,"Procédure linge sale","Intégrer le conditionnement (sacs étanches) dans la procédure linge sale"]
[null,"Procédure linge sale","Intégrer un lieu de stockage intermédiaire dans la procédure linge sale, ou organiser le bionettoyage immédiat de l'ascenseur au décours de la descente du linge sale si elle est réalisée en temps réel"]
[null,"Circuit du linge sale","Demander le port de gants lors de la manipulation du linge sale"]
[null,"Circuit du linge sale","Demander une hygiène des mains après manipulation du linge sale"]
[null,"Circuit du linge sale","Demander la protection de la tenue avec des tabliers UU lors de la manipulation du linge sale"]
[null,"Circuit du linge sale","Mettre en place les moyens alloués permettant d'appliquer la procédure du circuit du linge avec les précautions standard"]
[null,"Circuit du linge sale","Prévoir un chariot /armoire/ local dédié fermé pour le linge propre"]
[null,"Circuit du linge sale","Fournir des sacs permettant le tri du linge sale /souillé dès la production"]
[null,"Circuit du linge sale","Mettre à disposition du personnel le matériel de protection pour la gestion du linge sale"]
[null,"Dechets","Rédiger, valider et diffuser la procédure déchet"]
[null,"Dechets","Valider la procédure déchet"]
[null,"Dechets","Diffuser la procédure déchet"]
[null,"Dechets","Réévaluer la procédure déchets"]
[null,"Dechets","Nommer une personne responsable de la politique de tri des déchets"]
[null,"Dechets","Intégrer le tri à la production des OM, DASRI, OPCT dans la politique de tri des déchets"]
[null,"Dechets","Intégrer le conditionnement identifié  des OM, DASRI, OPCT dans la politique de tri des déchets"]
[null,"Dechets","Intégrer le lieu de stockage conforme aux normes  des OM, DASRI, OPCT dans la politique de tri des déchets"]
[null,"Dechets","Intégrer l'évacuation et le transport des DASRI dans la politique de tri des déchets"]
[null,"Dechets","Intégrer les précautions standard dans la procédure / politique déchets puis rédiger, valider et diffuser"]
[null,"Dechets","Faire relever des DASRI tous les 7 jours (cf. onglet outils 2)"]
[null,"Dechets","Faire relever les DASRI tous les mois (cf. onglet outils 2)"]
[null,"Dechets","Faire relever les DASRI toutes les 72h (cf. onglet outils 2)"]
[null,"Dechets","Mettre à disposition des professionnels des sacs à déchets OM"]
[null,"Dechets","Mettre à disposition des professionnels des sacs ou cartons pour les DASRI"]
[null,"Dechets","Mettre à disposition des professionnels des collecteurs OPCT norme NFX 30500"]
[null,"Dechets","Mettre à la disposition du personnel une tenue de protection"]
[null,"Gestion de la qualité d'eau","Mettre en place le carnet sanitaire"]
[null,"Gestion de la qualité d'eau","Réaliser des prélèvement à la recherche de légionnelle dans l'ECS au moins une fois par an"]
[null,"Gestion de la qualité d'eau","Récuperer les plans du réseau auprès de la société qui a construit la structure, et si les plans sont indisponibles faire un audit du réseau avec demande d'une cartographie à intégrer dans le carnet sanitaire."]
[null,"Gestion de la qualité d'eau","Choisir un laboratoire accrédité COFRAC"]
[null,"Gestion de la qualité d'eau","Réaliser au moins 5 prélèvements annuels"]
[null,"Gestion de la qualité d'eau","Discuter la réalisation d'un audit du réseau d'eau par un organisme agréé"]
[null,"Gestion de la qualité d'eau","Signaler à l'ARS cellule environnementale toute contamination du réseau d'ECS ou EF par de la légionelle, afin d'avoir un appui pour la mise en œuvre des mesures à prendre, sécurisation des points d'usage, sensibilisation des médecins référents à la recherche de légionellose pulmonaires, mise en place de mesures correctives, et contrôle des prélèvement au décours"]
[null,"Gestion de la qualité d'eau","Rajouter dans le carnet sanitaire la traçabilité du suivi de la température de l'eau"]
[null,"Gestion de la qualité d'eau","Rajouter dans le carnet sanitaire la liste des travaux en cours "]
[null,"Gestion de la qualité d'eau","Ajouter dans le carnet sanitaire le calendrier et la traçabilité des opérations de maintenance sur le réseau"]
[null,"Gestion de la qualité d'eau","Rajouter dans le carnet sanitaire le traitement contre le  tartre"]
[null,"Gestion de la qualité d'eau","Rajouter dans le carnet sanitaire les traitements de désinfection de la robinetterie"]
[null,"Gestion de la qualité d'eau","Rajouter dans le carnet sanitaire les résultats d'analyse de l'eau"]
[null,"Gestion de la qualité d'eau","Intégrer au carnet sanitaire la circulaire n°493 du 28/10/2005 dans la règlementation"]
[null,"Gestion de la qualité d'eau","Intégrer dans le carnet sanitaire l'arrêté du 1er février 2010"]
[null,"Gestion de la qualité d'eau","Mettre en place un protocole de purge des points peu ou pas utilisés: 5 minutes eau froide et 5 minutes eau chaude à activer dès l'hospitalisation d'un résident et sur tous les points inutilisés.\nIntégrer la traçabilité des purges ECS et EF au carnet sanitaire"]
[null,"Gestion de la qualité d'eau","Intégrer les chiffres de consommation ECS et EF dans le carnet sanitaire"]
[null,"Gestion de la qualité d'eau","Intégrer au carnet sanitaire les fiches d'entretien et de suivi de la production et de la distribution"]
[null,"Gestion de la qualité d'eau","Rédiger,valider et diffuser, la procédure conduite à tenir devant une contamination (légionelle) du réseau ECS ou EF , détaillant la conduite à tenir dans l'établissement (arrêt ou sécurisation des usages à risques, actions curatives sur le réseau...), et incluant l'information systématique du médecin coordonateur"]
[null,"Gestion de la qualité d'eau","Inclure l'information systématique du médecin coordonnateur en cas de dysfonctionnement ou analyse non conforme sur le réseau d'eau"]
[null,"Gestion de la qualité d'eau","Rédiger,valider et diffuser, la procédure conduite à tenir devant une légionellose pulmonaire, détaillant la prise en charge du résident"]
[null,"Gestion de la qualité d'eau","Inclure dans la procédure CAT en cas de légionellose les actions à mener concernant le réseau d'eau"]
[null,"Gestion de la qualité d'eau","Inclure dans la procédure CAT en cas de légionellose les actions à mener concernant la déclaration obligatoire du cas"]
[null,"Gestion de la qualité d'eau","Contrôler annuellement la potabilité de l'eau sur l'arrivée de l'eau dans la structure et les points de consommation éventuels (cuisine...)"]
[null,"Gestion de la qualité d'eau","Vérifier les dates limites de consommation de l'eau embouteillée"]
[null,"Gestion de la qualité d'eau","Prévoir un lieu de stockage adapté pour l'eau embouteillée"]
[null,"Gestion de la qualité d'eau","Contrôler annuellement la potabilité de l'eau sur les fontaines"]
[null,"Gestion de la qualité d'eau","Organiser un entretien régulier des fontaines selon les préconisations du fabricant"]
[null,"Gestion de la qualité d'eau","Organiser la maintenance de la fontaine (circuit interne par prestataire et entretetien externe par la structure: détartrage désinfection des embouts et partie externe)"]
[null,"Gestion de la qualité d'eau","Mettre en place un cahier des charges concernant l'entretien des bonbonnes d'eau avec la société de distribution"]
[null,"Gestion de la qualité d'eau","Organiser une maintenance du système de distribution des bonbonnes d'eau avec la société de distribution"]
[null,"Gestion de la qualité d'eau","Rédiger, valider et diffuser une procédure de conduite à tenir en cas de résultats d'analyse non conforme de la qualité de l'eau de consommation alimentaire, ou de dysfonctionnement du système de distribution d'eau de consommation"]
[null,"Gestion de la qualité d'eau","Intégrer dans la procédure une alerte systématique du médecin coordonnateur en cas de dysfonctionnement du système de distribution de l'eau potable ou d'analyse non conforme"]
[null,"Gestion du matériel de soins","Privilégier l'utilisation de DM à usage unique"]
[null,"Gestion du matériel de soins","Rédiger valider diffuser la procédure  de nettoyage-désinfection du matériel de soins réutilisable"]
[null,"Gestion du matériel de soins","Rédiger valider diffuser la procédure  d'entretien des extracteurs d'oxygène"]
[null,"Gestion du matériel de soins","Valider la procédure d'entretien des extracteurs d'oxygène"]
[null,"Gestion du matériel de soins","Utiliser du détergent désinfectant pour l'entretien des extracteurs d'oxygène (à intégrer dans la procédure le cas échéant)"]
[null,"Gestion du matériel de soins","Rédiger valider diffuser la procédure  d'entretien des générateurs d'aérosols"]
[null,"Gestion du matériel de soins","Valider la procédure d'entretien des générateurs d'aérosols"]
[null,"Gestion du matériel de soins","Utiliser du détergent désinfectant pour l'entretien des  générateurs d'aérosols (à intégrer dans la procédure le cas échéant)"]
[null,"Gestion du matériel de soins","Rédiger valider diffuser la procédure  d'entretien des thermomètres résidents"]
[null,"Gestion du matériel de soins","Valider la procédure d'entretien des thermomètres résidents"]
[null,"Gestion du matériel de soins","Utiliser du détergent désinfectant pour l'entretien des  thermomètres résidents (à intégrer dans la procédure le cas échéant)"]
[null,"Gestion du matériel de soins","Rédiger valider diffuser la procédure  d'entretien des brassards à tension"]
[null,"Gestion du matériel de soins","Valider la procédure d'entretien des brassards à tension"]
[null,"Gestion du matériel de soins","Utiliser du détergent désinfectant pour l'entretien des  brassards à tension (à intégrer dans la procédure le cas échéant)"]
[null,"Gestion du matériel de soins","Rédiger valider diffuser la procédure  d'entretien des chariots lits douches fauteuils"]
[null,"Gestion du matériel de soins","Valider la procédure d'entretien des  chariots lits douches fauteuils"]
[null,"Gestion du matériel de soins","Utiliser du détergent désinfectant ou un nettoyeur vapeur pour l'entretien des chariots lits douches fauteuils (à intégrer dans la procédure le cas échéant)"]
[null,"Gestion du matériel de soins","Rédiger valider diffuser la procédure  d'entretien des lève malade"]
[null,"Gestion du matériel de soins","Valider la procédure d'entretien des  lève malade"]
[null,"Gestion du matériel de soins","Utiliser du détergent désinfectant ou un nettoyeur vapeur pour l'entretien des lève malade (à intégrer dans la procédure le cas échéant)"]
[null,"Gestion du matériel de soins","Rédiger valider diffuser la procédure  d'entretien des chariot de soins"]
[null,"Gestion du matériel de soins","Valider la procédure d'entretien des   chariot de soins"]
[null,"Gestion du matériel de soins","Utiliser du détergent désinfectant ou un nettoyeur vapeur pour l'entretien des chariot de soins (à intégrer dans la procédure le cas échéant)"]
[null,"Gestion du matériel de soins","Rédiger valider diffuser la procédure  d'entretien des chariot de distribution des médicaments"]
[null,"Gestion du matériel de soins","Valider la procédure d'entretien des   chariot de distribution des médicaments"]
[null,"Gestion du matériel de soins","Utiliser du détergent désinfectant ou un nettoyeur vapeur pour l'entretien des chariot de distribution des médicaments (à intégrer dans la procédure le cas échéant)"]
[null,"Gestion du matériel de soins","Rédiger valider diffuser la procédure  d'entretien des chariot de linge propre"]
[null,"Gestion du matériel de soins","Valider la procédure d'entretien des chariot de linge propre"]
[null,"Gestion du matériel de soins","Utiliser du détergent désinfectant ou un nettoyeur vapeur pour l'entretien des chariot de linge propre (à intégrer dans la procédure le cas échéant)"]
[null,"Gestion du matériel de soins","Rédiger valider diffuser la procédure  d'entretien des chariot de linge sale"]
[null,"Gestion du matériel de soins","Valider la procédure d'entretien des chariot de linge sale"]
[null,"Gestion du matériel de soins","Utiliser du détergent désinfectant ou un nettoyeur vapeur pour l'entretien des chariot de linge sale (à intégrer dans la procédure le cas échéant)"]
[null,"Gestion du matériel de soins","Rédiger valider diffuser la procédure  d'entretien des chaises de pesée, plateforme"]
[null,"Gestion du matériel de soins","Valider la procédure d'entretien des chaises de pesée, plateforme"]
[null,"Gestion du matériel de soins","Utiliser du détergent désinfectant ou un nettoyeur vapeur pour l'entretien des chaises de pesée, plateforme (à intégrer dans la procédure le cas échéant)"]
[null,"Gestion du matériel de soins","Rédiger valider diffuser la procédure  d'entretien des bassins et urinaux"]
[null,"Gestion du matériel de soins","Valider la procédure d'entretien des bassins et urinaux"]
[null,"Gestion du matériel de soins","Utiliser du détergent désinfectant pour l'entretien des bassins et urinaux (à intégrer dans la procédure le cas échéant)"]
[null,"Gestion des soins","Rédiger valider diffuser la procédure Aérosolthérapie"]
[null,"Gestion des soins","Valider diffuser la procédure Aérosolthérapie"]
[null,"Gestion des soins","Rédiger valider diffuser la procédure alimentation entérale"]
[null,"Gestion des soins","Valider diffuser la procédure alimentation entérale"]
[null,"Gestion des soins","Rédiger valider diffuser la procédure aspiration buccale ou bronchique"]
[null,"Gestion des soins","Valider diffuser la procédure aspiration buccale ou bronchique"]
[null,"Gestion des soins","Rédiger valider diffuser la procédure hygiène des mains et port de gants"]
[null,"Gestion des soins","Valider diffuser la procédure hygiène des mains et port de gants"]
[null,"Gestion des soins","Rédiger valider diffuser la procédure injection IM/SC/IV"]
[null,"Gestion des soins","Valider diffuser la procédure injection IM/SC/IV"]
[null,"Gestion des soins","Rédiger valider diffuser la procédure oxygénothérapie"]
[null,"Gestion des soins","Valider diffuser la procédure oxygénothérapie"]
[null,"Gestion des soins","Rédiger valider diffuser la procédure de prise en charge des plaies  (escarre ulcère…)"]
[null,"Gestion des soins","Valider diffuser la procédure de prise en charge des plaies (escarre, ulcère…)"]
[null,"Gestion des soins","Rédiger valider diffuser la procédure pose d'une perfusion sous cutanée"]
[null,"Gestion des soins","Valider diffuser la procédure pose d'une perfusion sous cutanée"]
[null,"Gestion des soins","Rédiger valider diffuser la procédure pose d'une voie veineuse"]
[null,"Gestion des soins","Valider diffuser la procédure pose d'une voie veineuse"]
[null,"Gestion des soins","Rédiger valider diffuser la procédure précautions complémentaires"]
[null,"Gestion des soins","Valider diffuser la procédure précautions complémentaires"]
[null,"Gestion des soins","Rédiger valider diffuser la procédure précautions standard"]
[null,"Gestion des soins","Valider diffuser la procédure précautions standard"]
[null,"Gestion des soins","Rédiger valider diffuser la procédure prélèvement veineux"]
[null,"Gestion des soins","Valider diffuser la procédure prélèvement veineux"]
[null,"Gestion des soins","Rédiger valider diffuser la procédure soins de nursing (toilette, soins bucco-dentaire…)"]
[null,"Gestion des soins","Valider diffuser la procédure soins de nursing (toilette, soins bucco-dentaire…)"]
[null,"Gestion des soins","Rédiger valider diffuser la procédure sondage vésical"]
[null,"Gestion des soins","Valider diffuser la procédure sondage vésical"]
[null,"Gestion des soins","Rédiger valider diffuser la procédure stomies"]
[null,"Gestion des soins","Valider diffuser la procédure stomies"]
[null,"Antiseptiques","Rédiger valider diffuser la procédure antiseptiques"]
[null,"Antiseptiques","Valider la procédure antiseptiques"]
[null,null,"Diffuser la procédure antiseptiques"]
[null,"Antiseptiques","Préciser le temps de contact des antiseptiques dans la procédure"]
[null,"Antiseptiques","Demander d'inscrire la date d'ouverture sur le flacon dans la procédure"]
[null,"Antiseptiques","Faire le choix consensuel de 2 gammes d'antiseptiques"]
[null,"Antiseptiques","Intégrer la nécessité d'une prescription médicale pour l'utilisation des antiseptiques sur les plaies"]
[null,"Antiseptiques","Valoriser l'utilisation d'antiseptiques alcooliques"]
[null,"Antiseptiques","Préconiser l'antisepsie en 4 temps pour la pose de dispositifs invasifs"]
[null,"Précautions standard","Réaliser une formation/information large sur les précautions standard auprès des professionnels de l'établissement"]
[null,"Précautions standard","Valoriser la politique sur l'hygiène des mains (zéro bijou, utilisation du SHA…)"]
[null,"Précautions standard","Mettre des distributeurs de SHA à disposition de tout le personnel et des usagers (flacons de poche, distributeurs muraux dans les salles à manger, salles d'animation…)"]
[null,"Précautions standard","Faire une information sur l'utilisation du SHA"]
[null,"Précautions standard","Mettre en place des distributeurs d'essuie-mains à chaque poste de lavage des mains"]
[null,"Précautions standard","Mettre en place des distributeurs de savon doux liquide à chaque poste de lavage des mains"]
[null,"Précautions standard","Mettre en place une poubelle à commande non manuelle à chaque poste de lavage des mains"]
[null,"Précautions standard","Mettre à la disposition des professionnels des gans non stériles à UU"]
[null,"Précautions standard","Promouvoir l'utilisation de gants non poudrés"]
[null,"Précautions standard","Promouvoir le principe UN GESTE = UNE PAIRE DE GANTS"]
[null,"Précautions complémentaires","Faire une information sur les précautions complémentaires "]
[null,"Précautions complémentaires","Rédiger, valider et diffuser la procédure précautions complémentaires contact"]
[null,"Précautions complémentaires","Rédiger, valider et diffuser la procédure précautions complémentaires gouttelettes"]
[null,"Précautions complémentaires","Rédiger, valider et diffuser la procédure précautions complémentaires air"]
[null,"Précautions complémentaires","Inventer en équipe une signalisation non stigmatisante pour permettre aux soignants et aux familles de repérer le fait qu'il faille  prendre des précautions d'hygiène"]
[null,"Hygiène du résident","Organiser et plannifier les toilettes et soins de nursing"]
[null,"Hygiène du résident","Organiser la surveillance de l'état bucco-dentaire des résidents"]
[null,"Hygiène du résident","Organiser la mise en œuvre de l'hygiène des mains aux résidents (avant les repas, ou les activités collectives…)"]
[null,"Vaccination","Organiser la vaccination antigrippale des résidents"]
[null,"Vaccination","Encourager la vaccination antigrippale des professionnels de la structure"]
[null,"Vaccination","Prendre en charge les vaccins antigrippaux destinés aux professionnels"]
[null,"Vaccination","Promouvoir la vaccination antipneumococcique des résidents (à évaluer à l'admission puis suivi des rappels)"]
[null,"Vaccination","Faire suivre les professionnels par la médecine du travail, et promouvoir le rappel de la vaccination contre la coqueluche si non réalisé selon le calendrier vaccinal 2014"]
[null,"Vaccination","Faire le suivi des % de vaccination antipneumococcique et antigrippales des résidents"]
[null,"Vaccination","Faire le suivi des % de vaccination antigrippale du personnel soignant"]
[null,"Vaccination","Demander au médecin du travail une estimation du % de soignants à jours de leurs vaccination contre la coqueluche"]
[null,"Gale","Rédiger, valider et diffuser la procédure conduite à tenir en cas de gale"]
[null,"Gale","Ecrire le protocole CAT en cas de gale"]
[null,"Gale","Valider le protocole CAT en cas de gale"]
[null,"Gale","Diffuser le protocole CAT en cas de gale"]
[null,"Gale","Prendre contact auprès du pharmacien pour avoir la possibilité de prescrire de l'Ivermectine dans la structure"]
[null,"Gale","Faire prescrire toute mise en précaution complémentaire d'hygiène  par les médecins traitants avec consignes de levées des mesures "]
[null,"Gale","Prévoir un isolement géographique jusqu'à 48 à 72h après le début du traitement curatif en cas de gale"]
[null,"Gale","Vérifier la possibilité d'acquérir des anti-acariens pour le traitement du linge ou mobilier "]
[null,"Gale","Prévoir une procédure et une traçabilité pour l'information donnée au résident et à sa famille concernant les suspicions ou cas de gale"]
[null,"Gale","Intégrer dans la procédure la nécessité de consigner dans le dossier du résident le cas de gale"]
[null,"Tuberculose","Rédiger, valider, diffuser la procédure conduite à tenir en cas de Tuberculose"]
[null,"Tuberculose","Ecrire le protocole CAT en cas de Tuberculose"]
[null,"Tuberculose","Valider le protocole CAT en cas de Tuberculose"]
[null,"Tuberculose","Diffuser le protocole CAT en cas de Tuberculose"]
[null,"Tuberculose","Prévoir une déclaration obligatoire auprès de la CVGAS de l'ARS en cas de Tuberculose"]
[null,"Tuberculose","Identifier le CLAT"]
[null,"Tuberculose","Prévoir une information systématique auprès du médecin du travail"]
[null,"Tuberculose","Prévoir un avis spécialisé en cas de suspicion de tuberculose"]
[null,"Tuberculose","Prévoir une hospitalisation en médecine en cas de suspicion de tuberculose"]
[null,"Tuberculose","Prévoir des mesure de dépistage concernant les autres résidents"]
[null,"Tuberculose","Prévoir la mise en place des précautions complémentaires AIR en attente du transfert"]
[null,"Tuberculose","Prévoir des masques chirurgicaux pour le résident en PCA"]
[null,"Tuberculose","Prévoir des masques FFP2 pour le personnel prenant en charge le résident en PCA"]
[null,"Epidémie de GEA","Rédiger, valider, diffuser la procédure conduite à tenir en cas d'épidémie de GEA à partir de 3 cas"]
[null,"Epidémie de GEA","Ecrire le protocole CAT en cas d'épidémie de GEA à partir de 3 cas"]
[null,"Epidémie de GEA","Valider le protocole CAT en cas d'épidémie de GEA"]
[null,"Epidémie de GEA","Diffuser le protocole CAT en cas d'épidémie de GEA"]
[null,"Epidémie de GEA","Prévoir la mise en place de précautions complémentaires contact en cas de GEA"]
[null,"Epidémie de GEA","Prévoir le maintien en chambre des résidents suspects d'infection à clostridium difficile"]
[null,"Epidémie de GEA","Prévoir le traitement des locaux en trois temps avec de l'eau de Javel diluée au 1/5ème en cas de suspicion d'infection à clostridium difficile"]
[null,"Epidémie de GEA","Intégrer au plan de maitrise d'épidémie l'information des résidents en cas d'épidémie de GEA"]
[null,"Epidémie de GEA","Intégrer au plan de maitrise d'épidémie l'information du conseil de la vie sociale en cas d'épidémie de GEA"]
[null,"Epidémie de GEA","Intégrer au plan de maitrise d'épidémie l'information des salariés en cas d'épidémie de GEA"]
[null,"Epidémie de GEA","Intégrer au plan de maitrise d'épidémie l'information des familles en cas d'épidémie de GEA"]
[null,"Epidémie d'IRAB","Rédiger, valider et diffuser une conduite à tenir pour la prise en charge des résidents atteints d'infection respiratoire aigue basse"]
[null,"Epidémie d'IRAB","Ecrire le protocole CAT en cas d'épidémie d'IRA"]
[null,"Epidémie d'IRAB","Valider le protocole CAT en cas d'épidémie d'IRA"]
[null,"Epidémie d'IRAB","Diffuser le protocole CAT en cas d'épidémie d'IRA"]
[null,"Epidémie d'IRAB","Inclure dans la procédure la mise en précautions complémentaires gouttelettes du résident atteind d'IRA"]
[null,"Epidémie d'IRAB","Inclure dans la procédure l'utilisation de masques chirurgicaux pour les professionnels prenant en charge un résident atteint d'IRA"]
[null,"Epidémie d'IRAB","Inclure dans la procédure l'utilisation de masques chirurgicaux pour les résidents atteints d'IRA sortant de leur chambre"]
[null,"Epidémie d'IRAB","Inclure dans la procédure l'interruption provisoire des activités collectives pour les résidents atteints d'IRA "]
[null,"AES","Vérifier auprès du médecin du travail que les soignants sont à jour concernant leur vaccination VHB"]
[null,"AES","Prévoir une formation sur les AES pour les soignants salariés et les personnels extérieurs"]
[null,"AES","Rédiger valider diffuser la procédure CAT en cas d'AES"]
[null,"AES","Valider la procédure CAT en cas d'AES"]
[null,"AES","Diffuser la procédure CAT en cas d'AES"]
[null,"AES","Afficher la CAT en cas d'AES dans les lieux communs du personnel et des intervenants (salle de soins...)"]
[null,"AES","Prévoir de faire un test rapide de dépistage VIH du résident source avec son accord ou celui de sa personne de confiance ou de son référent familial"]
[null,"AES","Réaliser un suivi des AES en lien avec le médecin du travail"]
[null,"AES","Prioriser la prévention AES "]
[null,"AES","Présenter le suivi des AES en CHSCT"]
[null,"AES","Fournir des gants non stériles UU aux professionnels"]
[null,"AES","Fournir des masques chirurgicaux aux professionnels"]
[null,"AES","Fournir des lunettes de protection aux professionnels"]
[null,"AES","Fournir des collecteurs OPCT munis de fixation aux professionnels"]
[null,"AES","Fournir du matériel sécurisé pour les prélèvements sanguins aux professionnels"]
[null,"AES","Fournir du matériel sécurisé pour les prélèvements capillaires aux professionnels"]
[null,"AES","Fournir du matériel sécurisé pour les injections aux professionnels"]
[null,"AES","Fournir du matériel sécurisé pour les perfusions veineuses aux professionnels"]
[null,"AES","Fournir du matériel sécurisé pour les perfusions sous cutanées aux professionnels"]
[null,"AES","Fournir du matériel sécurisé pour l'insulinothérapie par autopiqueur aux professionnels"]

{"sheet":"Poster","index":47,"n_rows":43,"n_cols":16,"rows_kept":43,"cut":false,"hidden":false,"merged":[[2,0,2,13],[1,1,1,13],[3,0,3,13],[28,0,33,13],[22,0,23,5],[24,0,24,5],[19,0,19,5],[20,0,20,5]]}
[]
[null,"MAITRISE DU RISQUE INFECTIEUX EN EHPAD",null,null,null,null,null,null,null,null,null,null,null,null,"   Pour imprimer le poster:"]
["Manuel d'auto-évaluation",null,null,null,null,null,null,null,null,null,null,null,null,null,"   Fichier \"Menu\" puis \"Imprimer\""]
[{"$f":"\"Date de l'évaluation: \"&TEXT(DATE,\"jj/mm/aaaa\")","v":"Date de l'évaluation: 00/01/1900"}]
[null,null,null,null,null,null,null,null,null,null,null,null,null,null,"Vous ne pourrez imprimer le poster que"]
["Etablissement ",null,null,null,null,null,null,"Résultats par chapitre des objectifs atteints (cible 100%)",null,null,null,null,null,null,"si vous avez saisi vos axes d'amélioration"]
[null,null,null,null,null,null,null,null,null,null,null,null,null,null,"et commentaires dans l'encadré jaune."]
[]
[{"$f":"IF(NOM=\"\",\"Nom de l'établissement non saisi\",NOM)","v":"Nom de l'établissement non saisi"}]
[]
["Nombre total de lits EHPAD",null,null,null,{"$f":"IF(NBLIT=\"\",\"Non saisi\",NBLIT)","v":"Non saisi"}]
[]
[]
[]
[]
["Résultat global"]
[]
[{"$f":"\"Vous obtenez un total de \"&Rapport!E31&\" points sur \"&Rapport!F31&\" attendus:\"","v":"Vous obtenez un total de 3 points sur 210 attendus:"}]
[]
[{"$f":"Rapport!E31/Rapport!F31","v":1.4285714285714285E-2}]
["d'objectifs atteints"]
[]
[{"$f":"IF(A20>=75%,post4,IF(A20>49%,post3,IF(A20>24%,post2,post1)))","v":"L'établissement est en retard dans la prévention des IAS et doit s'engager dans la mise en place d'un programme d'actions."}]
[]
["Consultez les scores par chapitre"]
[]
["Axes d'amélioration et commentaires"]
[]
[null,null,null,null,null,null,null,null,null,null,null,null,null,null,"◄ avant d'imprimer, veuillez"]
[null,null,null,null,null,null,null,null,null,null,null,null,null,null,"tapez vos axes d'amélioration"]
[null,null,null,null,null,null,null,null,null,null,null,null,null,null,"et commentaires dans le cadre"]
[null,null,null,null,null,null,null,null,null,null,null,null,null,null,"ci-contre."]
[]
[]
[]
["Les résultats détaillés figurent dans le rapport.",null,null,null,null,null,null,null,null,null,null,null,null,"Version Janvier 2011"]
[null,null,null,null,null,null,null,null,null,null,null,null,null,null,"VII - Prévention des AES",{"$f":"Rapport!L30","v":0}]
[null,null,null,null,null,null,null,null,null,null,null,null,null,null,"VI - Gestion des risques épidémiques",{"$f":"Rapport!L29","v":0}]
["L'établissement est en retard dans la prévention des IAS et doit s'engager dans la mise en place d'un programme d'actions.",null,null,null,null,null,null,null,null,null,null,null,null,null,"V - Vaccinations",{"$f":"Rapport!L28","v":0}]
["L'établissement a initié des actions mais doit encore améliorer les mesures mises en place ou les développer.",null,null,null,null,null,null,null,null,null,null,null,null,null,"IV - Gestion des soins",{"$f":"Rapport!L27","v":0}]
["L'établissement a mis en place une dynamique de gestion des IAS dont il doit poursuivre l'extension.",null,null,null,null,null,null,null,null,null,null,null,null,null,"III - Gestion du matériel de soins",{"$f":"Rapport!L26","v":0}]
["L'établissement est engagé fortement dans la prévention des IAS et doit poursuivre dans cette voie.",null,null,null,null,null,null,null,null,null,null,null,null,null,"II - Gestion de l'environnement et des circuits",{"$f":"Rapport!L25","v":3.8461538461538464E-2}]
[null,null,null,null,null,null,null,null,null,null,null,null,null,null,"I - Organisation des moyens de prévention",{"$f":"Rapport!L24","v":0}]

{"sheet":"Rapport","index":48,"n_rows":161,"n_cols":15,"rows_kept":161,"cut":false,"hidden":false,"merged":[[24,2,24,3],[25,2,25,3],[154,0,154,9],[137,3,137,6],[150,3,150,6],[76,3,76,6],[94,3,94,6],[110,3,110,6],[121,3,121,6],[156,0,161,9],[4,0,4,9],[5,0,5,9],[9,0,9,9],[58,3,58,6],[40,3,40,6],[41,3,41,6],[35,4,35,5],[33,3,33,6],[36,3,36,6],[26,2,26,3],[27,2,27,3],[28,2,28,3],[29,2,29,3],[23,2,23,3],[22,2,22,3]]}
[]
[]
[]
[null,null,null,null,null,null,null,null,null,null,null,"Pour imprimer le rapport:"]
["MAÎTRISE DU RISQUE INFECTIEUX EN EHPAD",null,null,null,null,null,null,null,null,null,null,"Menu \"Fichier\" puis \"Imprimer\""]
["Manuel d'auto-évaluation"]
[]
[]
[]
["RESULTATS"]
[]
[]
[]
[null,null,"Etablissement:",null,{"$f":"IF(NOM=\"\",\"A préciser\",NOM)","v":"A préciser"}]
[]
[null,null,"Date de l'evaluation:",null,{"$f":"IF(DATE=\"\",\"A préciser\",DATE)","v":"A préciser"}]
[]
[]
[]
[]
[null,"►","SCORES TOTAUX PAR CHAPITRE"]
[]
[null,null,"Chapitres",null,"Nombre de points obtenus","Nombre de points attendus","% d'objectifs atteints"]
[null,null,"I - Organisation",null,{"$f":"E55","v":0},{"$f":"F55","v":24},{"$f":"G55","v":0},null,null,null,null,{"$f":"E24/F24","v":0}]
[null,null,"II - Environnement et circuits",null,{"$f":"E73","v":3},{"$f":"F73","v":78},{"$f":"G73","v":3.8461538461538463},null,null,null,null,{"$f":"E25/F25","v":3.8461538461538464E-2}]
[null,null,"III - Gestion du matériel",null,{"$f":"E91","v":0},{"$f":"F91","v":14},{"$f":"G91","v":0},null,null,null,null,0]
[null,null,"IV - Gestion des soins",null,{"$f":"E107","v":0},{"$f":"F107","v":33},{"$f":"G107","v":0},null,null,null,null,0]
[null,null,"V - Vaccinations",null,{"$f":"E118","v":0},{"$f":"F118","v":16},{"$f":"G118","v":0},null,null,null,null,0]
[null,null,"VI - Risques épidémiques",null,{"$f":"E134","v":0},{"$f":"F134","v":28},{"$f":"G134","v":0},null,null,null,null,0]
[null,null,"VII - Prévention des AES",null,{"$f":"E147","v":0},{"$f":"F147","v":17},{"$f":"G147","v":0},null,null,null,null,0]
[null,null,null,null,{"$f":"SUM(E24:E30)","v":3},{"$f":"SUM(F24:F30)","v":210}]
[]
[]
[null,null,null,{"$f":"\"Vous obtenez un total de \"&E31 &\" points sur \"&F31&\" soit:\"","v":"Vous obtenez un total de 3 points sur 210 soit:"}]
[]
[null,null,null,null,{"$f":"E31/F31","v":1.4285714285714285E-2},null,null,null,null,null,null,null,null,"La politique concernant la prévention des Infections Associées aux Soins est soit très en retard soit absente. Il est important que votre établissement définisse de façon prioritaire un programme et des mesures appropriées pour prévenir les infections."]
[null,null,null,"d'objectifs atteints"]
[null,null,null,null,null,null,null,null,null,null,null,null,null,"Votre établissement a initié une politique de prévention des Infections Associées aux Soins mais elle est encore insuffisante. Vous devez regarder les scores par chapitre pour repérer les points à améliorer."]
[]
[null,null,null,null,null,null,null,null,null,null,null,null,null,"Votre établissement a mis en place une vraie politique de gestion du risque infectieux auprès des résidents. Il persiste toutefois des axes d'amélioration qui doivent être explorés. Vous devez regarder les scores par chapitre et repérer les insuffisances afin de mettre en place les mesures d'amélioration."]
[]
[null,null,null,{"$f":"IF(E36>=75%,GLOBAL4,IF(E36>49%,GLOBAL3,IF(E36>24%,GLOBAL2,GLOBAL1)))","v":"La politique concernant la prévention des Infections Associées aux Soins est soit très en retard soit absente. Il est important que votre établissement définisse de façon prioritaire un programme et des mesures appropriées pour prévenir les infections."},null,null,null,null,null,null,null,null,null,"Votre établissement obtient un score compris entre 75% et 100% qui traduit une politique forte de gestion du risque infectieux. Néanmoins, quelques points peuvent être encore améliorés ou consolidés. Le détail des chapitres vous indiquera les axes de travail."]
[]
[]
[]
[]
[]
[null,"►","CHAPITRE I - ORGANISATION DES MOYENS DE PREVENTION DANS L'ETABLISSEMENT"]
[null,null,null,null,null,null,null,null,null,null,null,"Page 2/4"]
[null,null,null,"Thèmes","Nombre de points obtenus","Nombre de points attendus","% d'objectifs atteints",null,null,null,null,null,null,null,"Votre établissement a un retard important dans ce secteur. Vous devez initier un programme d'actions. Les thèmes apparaissant dans les tableaux seront repris un par un, en priorité ceux figurant dans les cases rouges, et déclinés en mesures correctrices afin d'améliorer la prévention auprès des résidents."]
[null,null,null,"1-Moyens",{"$f":"Score1!L2","v":0},{"$f":"Score1!M2","v":9},{"$f":"Score1!AI2","v":0},null,null,null,null,null,null,null,"Votre établissement s'est engagé dans la prévention des Infections Associées aux Soins mais elle est encore incomplète. Le détail des résultats contenus dans le tableau vous informe sur les thèmes à améliorer. Ils doivent faire l'objet de mesures à inscrire dans votre programme d'actions."]
[null,null,null,"2-Surveillance / Alerte / Indicateurs",{"$f":"Score1!T2","v":0},{"$f":"Score1!U2","v":6},{"$f":"Score1!AJ2","v":0},null,null,null,null,null,null,null,"Votre établissement s'est engagé de manière significative dans la prévention des Infections Associées aux Soins. Le détail des résultats contenus dans le tableau vous informe sur les thèmes à améliorer. Ils doivent faire l'objet de mesures à inscrire dans votre programme d'actions."]
[null,null,null,"3-Antibiotiques",{"$f":"Score1!X2","v":0},{"$f":"Score1!Y2","v":2},{"$f":"Score1!AK2","v":0}]
[null,null,null,"4-Tenue",{"$f":"Score1!AG2","v":0},{"$f":"Score1!AH2","v":7},{"$f":"Score1!AL2","v":0},null,null,null,null,null,null,null,"Votre score traduit un engagement fort de l'établissement dans la prévention des Infections Associées aux Soins. Le détail des résultats de ce chapitre peut encore vous permettre d'améliorer certains éléments de prévention."]
[null,null,null,"Total",{"$f":"SUM(E51:E54)","v":0},{"$f":"SUM(F51:F54)","v":24},{"$f":"Score1!AO2","v":0}]
[]
[]
[null,null,null,null,{"$f":"\"Vous avez obtenu un résultat de \"&FIXED(G55,1) &\"%\"","v":"Vous avez obtenu un résultat de 0,0%"}]
[null,null,null,{"$f":"IF(G55>=75,_RES4,IF(G55>49,_RES3,IF(G55>24,_RES2,_RES1)))","v":"Votre établissement a un retard important dans ce secteur. Vous devez initier un programme d'actions. Les thèmes apparaissant dans les tableaux seront repris un par un, en priorité ceux figurant dans les cases rouges, et déclinés en mesures correctrices afin d'améliorer la prévention auprès des résidents."}]
[]
[]
[]
[]
[]
[null,"►","CHAPITRE II - GESTION DE L'ENVIRONNEMENT ET DES CIRCUITS"]
[]
[null,null,null,"Thèmes","Nombre de points obtenus","Nombre de points attendus","% d'objectifs atteints"]
[null,null,null,"1-Locaux",{"$f":"Score2!O2","v":0},{"$f":"Score2!Q2","v":12},{"$f":"Score2!DH2","v":0}]
[null,null,null,"2-Restauration",{"$f":"Score2!AJ2","v":0},{"$f":"Score2!AP2","v":16},{"$f":"Score2!DI2","v":0}]
[null,null,null,"3-Linge",{"$f":"Score2!BA2","v":3},{"$f":"Score2!BB2","v":10},{"$f":"Score2!DJ2","v":30}]
[null,null,null,"4-Déchets*",{"$f":"Score2!BK2","v":0},{"$f":"Score2!BL2","v":7},{"$f":"Score2!DK2","v":0}]
[null,null,null,"5-Eau",{"$f":"Score2!CT2","v":0},{"$f":"Score2!DG2","v":33},{"$f":"Score2!DL2","v":0}]
[null,null,null,"Total",{"$f":"SUM(E68:E72)","v":3},{"$f":"SUM(F68:F72)","v":78},{"$f":"Score2!DO2","v":3.8461538461538463}]
[]
[]
[null,null,null,null,{"$f":"\"Vous avez obtenu un résultat de \"&FIXED(G73,1) &\"%\"","v":"Vous avez obtenu un résultat de 3,8%"}]
[null,null,null,{"$f":"IF(G73>=75,_RES4,IF(G73>49,_RES3,IF(G73>24,_RES2,_RES1)))","v":"Votre établissement a un retard important dans ce secteur. Vous devez initier un programme d'actions. Les thèmes apparaissant dans les tableaux seront repris un par un, en priorité ceux figurant dans les cases rouges, et déclinés en mesures correctrices afin d'améliorer la prévention auprès des résidents."}]
[]
[]
[null,null,null,"*Délai de stockage des DASRI conforme:"]
[null,null,null,"> 100 kg / semaine = 72 heures"]
[null,null,null,"Entre 5 kg / mois et 100 kg / semaine = 7 jours"]
[null,null,null,"< 5 kg / mois = 3 mois"]
[]
[]
[]
[]
[null,"►","CHAPITRE III - GESTION DU MATERIEL DE SOINS",null,null,null,null,null,null,null,null,"Page 3/4"]
[]
[null,null,null,null,"Nombre de points obtenus","Nombre de points attendus","% d'objectifs atteints"]
[null,null,null,"Total",{"$f":"Score3!AC2","v":0},{"$f":"Score3!AD2","v":14},{"$f":"Score3!AE2","v":0}]
[]
[]
[null,null,null,null,{"$f":"\"Vous avez obtenu un résultat de \"&FIXED(G91,1) &\"%\"","v":"Vous avez obtenu un résultat de 0,0%"}]
[null,null,null,{"$f":"IF(G91>=75,_RES4,IF(G91>49,_RES3,IF(G91>24,_RES2,_RES1)))","v":"Votre établissement a un retard important dans ce secteur. Vous devez initier un programme d'actions. Les thèmes apparaissant dans les tableaux seront repris un par un, en priorité ceux figurant dans les cases rouges, et déclinés en mesures correctrices afin d'améliorer la prévention auprès des résidents."}]
[]
[]
[]
[null,"►","CHAPITRE IV - GESTION DES SOINS"]
[]
[null,null,null,"Thèmes","Nombre de points obtenus","Nombre de points attendus","% d'objectifs atteints"]
[null,null,null,"1-Actes infirmiers et de nursing",{"$f":"Score4!N2","v":0},{"$f":"Score4!S2","v":11},{"$f":"Score4!AX2","v":0}]
[null,null,null,"2-Antiseptiques",{"$f":"Score4!AB2","v":0},{"$f":"Score4!AC2","v":8},{"$f":"Score4!AY2","v":0}]
[null,null,null,"3-Précautions standard",{"$f":"Score4!AL2","v":0},{"$f":"Score4!AM2","v":8},{"$f":"Score4!AZ2","v":0}]
[null,null,null,"4-Précautions complémentaires",{"$f":"Score4!AQ2","v":0},{"$f":"Score4!AR2","v":3},{"$f":"Score4!BA2","v":0}]
[null,null,null,"5-Hygiène des résidents",{"$f":"Score4!AV2","v":0},{"$f":"Score4!AW2","v":3},{"$f":"Score4!BB2","v":0}]
[null,null,null,"Total",{"$f":"SUM(E102:E106)","v":0},{"$f":"SUM(F102:F106)","v":33},{"$f":"Score4!BE2","v":0}]
[]
[]
[null,null,null,null,{"$f":"\"Vous avez obtenu un résultat de \"&FIXED(G107,1) &\"%\"","v":"Vous avez obtenu un résultat de 0,0%"}]
[null,null,null,{"$f":"IF(G107>=75,_RES4,IF(G107>49,_RES3,IF(G107>24,_RES2,_RES1)))","v":"Votre établissement a un retard important dans ce secteur. Vous devez initier un programme d'actions. Les thèmes apparaissant dans les tableaux seront repris un par un, en priorité ceux figurant dans les cases rouges, et déclinés en mesures correctrices afin d'améliorer la prévention auprès des résidents."}]
[]
[]
[]
[null,"►","CHAPITRE V - LES VACCINATIONS CONTRE LES AFFECTIONS RESPIRATOIRES"]
[]
[null,null,null,null,"Nombre de points obtenus","Nombre de points attendus","% d'objectifs atteints"]
[null,null,null,"Total",{"$f":"Score5!L2","v":0},{"$f":"Score5!M2","v":16},{"$f":"Score5!N2","v":0}]
[]
[]
[null,null,null,null,{"$f":"\"Vous avez obtenu un résultat de \"&FIXED(G118,1) &\"%\"","v":"Vous avez obtenu un résultat de 0,0%"}]
[null,null,null,{"$f":"IF(G118>=75,_RES4,IF(G118>49,_RES3,IF(G118>24,_RES2,_RES1)))","v":"Votre établissement a un retard important dans ce secteur. Vous devez initier un programme d'actions. Les thèmes apparaissant dans les tableaux seront repris un par un, en priorité ceux figurant dans les cases rouges, et déclinés en mesures correctrices afin d'améliorer la prévention auprès des résidents."}]
[]
[]
[]
[null,null,null,null,null,null,null,null,null,null,null,"Page 4/4"]
[null,"►","CHAPITRE VI - GESTION DES RISQUES EPIDEMIQUES"]
[]
[null,null,null,"Thèmes","Nombre de points obtenus","Nombre de points attendus","% d'objectifs atteints"]
[null,null,null,"1-Gale",{"$f":"Score6!J2","v":0},{"$f":"Score6!K2","v":7},{"$f":"Score6!AM2","v":0}]
[null,null,null,"2-Tuberculose pulmonaire",{"$f":"Score6!V2","v":0},{"$f":"Score6!W2","v":10},{"$f":"Score6!AN2","v":0}]
[null,null,null,"3-Gastro-entérite",{"$f":"Score6!AC2","v":0},{"$f":"Score6!AD2","v":5},{"$f":"Score6!AO2","v":0}]
[null,null,null,"4-Infection respiratoire aiguë basse",{"$f":"Score6!AK2","v":0},{"$f":"Score6!AL2","v":6},{"$f":"Score6!AP2","v":0}]
[null,null,null,"Total",{"$f":"SUM(E130:E133)","v":0},{"$f":"SUM(F130:F133)","v":28},{"$f":"Score6!AS2","v":0}]
[]
[]
[null,null,null,null,{"$f":"\"Vous avez obtenu un résultat de \"&FIXED(G134,1) &\"%\"","v":"Vous avez obtenu un résultat de 0,0%"}]
[null,null,null,{"$f":"IF(G134>=75,_RES4,IF(G134>49,_RES3,IF(G134>24,_RES2,_RES1)))","v":"Votre établissement a un retard important dans ce secteur. Vous devez initier un programme d'actions. Les thèmes apparaissant dans les tableaux seront repris un par un, en priorité ceux figurant dans les cases rouges, et déclinés en mesures correctrices afin d'améliorer la prévention auprès des résidents."}]
[]
[]
[]
[]
[]
[null,"►","CHAPITRE VII - PREVENTION DES ACCIDENTS AVEC EXPOSITION AU SANG"]
[]
[null,null,null,null,"Nombre de points obtenus","Nombre de points attendus","% d'objectifs atteints"]
[null,null,null,"Total",{"$f":"Score7!Z2","v":0},{"$f":"Score7!AA2","v":17},{"$f":"Score7!AB2","v":0}]
[]
[]
[null,null,null,null,{"$f":"\"Vous avez obtenu un résultat de \"&FIXED(G147,1) &\"%\"","v":"Vous avez obtenu un résultat de 0,0%"}]
[null,null,null,{"$f":"IF(G147>=75,_RES4,IF(G147>49,_RES3,IF(G147>24,_RES2,_RES1)))","v":"Votre établissement a un retard important dans ce secteur. Vous devez initier un programme d'actions. Les thèmes apparaissant dans les tableaux seront repris un par un, en priorité ceux figurant dans les cases rouges, et déclinés en mesures correctrices afin d'améliorer la prévention auprès des résidents."}]
[]
[]
[]
["NOTE DE L'ETABLISSEMENT"]
[]
[]
[null,null,null,null,null,null,null,null,null,null,"◄ Vous avez la possibilité de saisir "]
[null,null,null,null,null,null,null,null,null,null," des commentaires dans cet encadré."]
[]
[null,null,null,null,null,null,null,null,null,null,null,"Fin du rapport"]

{"sheet":"DARI","index":49,"n_rows":1129,"n_cols":4,"rows_kept":1129,"cut":false,"hidden":false,"merged":[[1019,0,1019,3],[1023,0,1023,3],[1048,0,1048,3],[1053,0,1053,3],[1031,0,1031,3],[883,0,883,3],[887,0,887,3],[1067,0,1067,3],[1071,0,1071,3],[961,0,963,3],[1011,0,1013,3],[1059,0,1061,3],[1109,0,1109,3],[1114,0,1114,3],[1079,0,1079,3],[625,0,625,3],[629,0,629,3],[689,0,689,3],[694,0,694,3],[400,0,400,3],[460,0,460,3],[417,0,417,3],[421,0,421,3],[435,0,435,3],[439,0,439,3],[456,0,456,3],[475,0,475,3],[479,0,479,3],[502,0,502,3],[507,0,507,3],[593,0,593,3],[729,0,729,3],[742,0,742,3],[746,0,746,3],[758,0,758,3],[604,0,604,3],[1,0,1,3],[93,0,93,1],[94,0,94,1],[4,0,4,3],[21,0,28,3],[6,0,6,3],[77,0,77,3],[81,0,81,3],[176,0,176,3],[2,0,2,3],[143,0,143,3],[163,0,163,3],[212,0,212,3],[159,0,159,3],[196,0,196,3],[232,0,232,3],[236,0,236,3],[8,0,8,3],[30,0,30,3],[107,0,107,3],[124,0,126,3],[91,0,91,3],[116,0,116,3],[120,0,120,3],[132,0,132,3],[112,0,112,3],[111,0,111,3],[190,0,190,3],[191,0,191,3],[227,0,227,3],[228,0,228,3],[136,0,136,3],[180,0,180,3],[216,0,216,3],[167,0,169,3],[200,0,200,3],[589,0,589,3],[323,0,323,3],[327,0,327,3],[339,0,339,3],[343,0,343,3],[411,0,411,3],[412,0,412,3],[564,0,564,3],[565,0,565,3],[446,0,446,3],[486,0,486,3],[407,0,407,3],[560,0,560,3],[834,0,834,3],[763,0,763,3],[707,0,707,3],[711,0,711,3],[724,0,724,3],[927,0,929,3],[282,0,282,3],[286,0,286,3],[684,0,684,3],[334,0,334,3],[734,0,736,3],[767,0,769,3],[842,0,844,3],[891,0,893,3],[829,0,829,3],[299,0,299,3],[300,0,300,3],[373,0,373,3],[374,0,374,3],[450,0,450,3],[451,0,451,3],[309,0,309,3],[358,0,358,3],[362,0,362,3],[1120,0,1122,3],[600,0,600,3],[719,0,719,3],[753,0,753,3],[899,0,899,3],[903,0,903,3],[915,0,915,3],[920,0,920,3],[923,0,923,3],[935,0,935,3],[939,0,939,3],[951,0,951,3],[956,0,956,3],[865,0,865,3],[788,0,788,3],[852,0,852,3],[856,0,856,3],[970,0,970,3],[974,0,974,3],[1001,0,1001,3],[1006,0,1006,3],[982,0,982,3],[776,0,776,3],[780,0,780,3],[615,0,617,3],[699,0,701,3],[349,0,351,3],[387,0,389,3],[426,0,428,3],[465,0,467,3],[512,0,514,3],[581,0,583,3],[240,0,252,3],[314,0,315,3],[379,0,379,3],[383,0,383,3],[396,0,396,3],[295,0,295,3],[254,1,254,3],[369,0,369,3],[288,0,288,3],[305,0,305,3],[284,0,284,3],[609,0,609,3],[549,0,549,3],[553,0,553,3],[570,0,570,3],[575,0,575,3]]}
[]
["Document d'analyse du risque infectieux"]
[{"$f":"Etablissement!E5","v":0}]
[]
["Pour répondre à la mise en oeuvre du programme national d’actions de prévention des infections associées aux soins (PROPIAS) 2015, une politique de maitrise du risque infectieux a été élaborée sur trois axes. \nLe premier axe vise à développer la prévention des IAS tout au long du parcours de santé en impliquant les soignants, les résidents et leurs aidants. \nLe deuxième axe vise à prévenir l’antibiorésistance \nLe troisième axe a pour objectif de lutter contre les infections associées aux actes invasifs. \nEnfin ce programme ne se fixe pas de limites dans le temps mais a des objectifs qui seront évalués et modifiés ou complétés au fil du temps. "]
[]
["La démarche d’analyse de risque infectieux comporte les étapes suivantes:\n\n1. Evaluation du risque et de sa maitrise\n      - Evaluation du risque à l'aide d'une évaluation de la criticité du risque infectieux par thématique:\nLes risques à criticité élevée sont spécifiés dans la catégorie \"points faibles prioritaires\"\nLes risques à criticité moyenne sont spécifiés dans la catégorie \"points à améliorer\"\n      - Evaluation de la maitrise du risque à l'aide de l'autoévaluation du GREPHH\n      - Evaluation de la maitrise du risque par l'évaluation des bonnes pratiques d'hygiène (audits, suivi de consommation, taux de vaccination...)\n      - Elaboration d'un Plan d'action d'amélioration de la gestion du risque infectieux détaillé pour sa mise en oeuvre dans l'onglet 'PLAN D'ACTION' final (personne en charge de l'action et échéancier)\nLes actions classées prioritaires apparaissent dans la catégorie \"plan d'action prioritaire\"\nLes actions classées à mettre en oeuvre dans un second temps apparaissent dans la catégorie \"le plan d'action prévoit également.\n\n• Communication sur le risque avec rétroinformation sur les résultats des audits aux professionnels\ncf. feuilles d'hémargement  \n\nCe document est mis à jour au minimum annuellement. \n"]
[]
["L’établissement a mis en place un Comité de pilotage du risque infectieux:\n\nLes missions de ce comité sont :\n•  Elaborer et mettre en oeuvre le plan de maitrise du risque infectieux à l'aide de l’Auto-évaluation Hygiène et Sécurité du GREPHH, du DARI, du PCA (Plan de Continuité des Activités), et à la veille documentaire.\n•  Informer en interne et en externe en cas d’alerte infectieuse\n•  Coordonner l’investigation et le suivi de l’épidémie en lien avec la cellule d’alerte ou de crise\n•  Servir de relai à l’équipe ou l'infirmière mobile d’hygiène si existe. \n•  S’assurer de la mise en œuvre des mesures de contrôle\n•  Participer à l’évaluation des pratiques."]
[]
["Composition du comité de pilotage"]
[]
[null,{"$f":"EHPAD!B16","v":"NOM PRENOM"},{"$f":"EHPAD!C16","v":"Téléphone"},{"$f":"EHPAD!D16:E16","v":"Mail"}]
[{"$f":"EHPAD!A17","v":"Directeur\n(à renseigner obligatoirement)"},{"$f":"EHPAD!B17","v":0},{"$f":"EHPAD!C17","v":0},{"$f":"EHPAD!D17:E17","v":0}]
[{"$f":"EHPAD!A18","v":"Médecin coordonateur\n(à renseigner obligatoirement)"},{"$f":"EHPAD!B18","v":0},{"$f":"EHPAD!C18","v":0},{"$f":"EHPAD!D18:E18","v":0}]
[{"$f":"EHPAD!A19","v":"IDEC/Cadre\n(à renseigner obligatoirement)"},{"$f":"EHPAD!B19","v":0},{"$f":"EHPAD!C19","v":0},{"$f":"EHPAD!D19:E19","v":0}]
[{"$f":"EHPAD!A20","v":"Référent(s) hygiène\n(à renseigner obligatoirement)"},{"$f":"EHPAD!B20","v":0},{"$f":"EHPAD!C20","v":0},{"$f":"EHPAD!D20:E20","v":0}]
[{"$f":"EHPAD!A21","v":"Référent Antibiotiques"},{"$f":"EHPAD!B21","v":0},{"$f":"EHPAD!C21","v":0},{"$f":"EHPAD!D21:E21","v":0}]
[{"$f":"EHPAD!A22","v":"Responsable Logistique\n(à renseigner obligatoirement)"},{"$f":"EHPAD!B22","v":0},{"$f":"EHPAD!C22","v":0},{"$f":"EHPAD!D22:E22","v":0}]
[{"$f":"EHPAD!A24","v":"EOHM \n(à renseigner le cas échéant)"},{"$f":"EHPAD!B24","v":0},{"$f":"EHPAD!C24","v":0},{"$f":"EHPAD!D24:E24","v":0}]
[]
["Les missions du référent en hygiène sont : \nInformer en interne et en externe en cas d’alerte infectieuse \nServir de relai à l’équipe opérationnelle d’hygiène. \nCoordonner l’investigation et le suivi de l’épidémie en lien avec la cellule d’alerte ou de crise\nS’assurer de la mise en œuvre des mesures de contrôle\nParticiper à l’évaluation des pratiques.\nParticiper à l’élaboration du DARI, du PCA (Plan de Continuité des Activités), et à la veille documentaire\n"]
[]
[]
[]
[]
[]
[]
[]
[]
["La structure a identifié les correspondants au sein de l’ARS, l’ARLIN, le CCLIN. (Cf. « Annuaire correspondants» onglet 'Plan de maitrise d'épidémie')"]
[]
[]
[]
[]
[]
[]
[]
[]
[]
[]
[]
[]
[]
["Chapitre I","Organisation"]
[]
[]
[]
["L'évaluation globale des moyens de maitrise de l'Organisation selon l'autoévaluation du GREPHH:"]
[]
[null,null,"% objectifs atteints"]
[null,"Total année en cours",{"$f":"Rapport!G55","v":0}]
[]
[]
[]
[]
[]
[]
[]
[]
[]
[]
[]
[]
[]
[]
[]
[]
[]
[]
[]
[]
[]
["I.1","Moyens"]
[]
["Les points faibles prioritaires sont:"]
[]
[{"$f":"IF(C88<20,\"Défaut de moyens de maitrise du risque infectieux\"&CHAR(10),\"\")&IF(COUNTIF('Eval 1'!E4,\"*élevé*\"),'Eval 1'!B4&CHAR(10),\"\")&IF(COUNTIF('Eval 1'!E5,\"*élevé*\"),'Eval 1'!B5&CHAR(10),\"\")&IF(COUNTIF('Eval 1'!E6,\"*élevé*\"),'Eval 1'!B6&CHAR(10),\"\")&IF(COUNTIF('Eval 1'!E7,\"*élevé*\"),'Eval 1'!B7&CHAR(10),\"\")&IF(COUNTIF('Eval 1'!E8,\"*élevé*\"),'Eval 1'!B8&CHAR(10),\"\")&IF(COUNTIF('Eval 1'!E9,\"*élevé*\"),'Eval 1'!B9&CHAR(10),\"\")&IF(COUNTIF('Eval 1'!E10,\"*élevé*\"),'Eval 1'!B10,\"\")","v":"Défaut de moyens de maitrise du risque infectieux\n"}]
[]
["Les points à améliorer sont"]
[]
[{"$f":"IF(AND(C88>=20,C88<80),\"Moyens de maitrise du risque infectieux à optimiser\"&CHAR(10),\"\")&IF(COUNTIF('Eval 1'!E4,\"*moyen*\"),'Eval 1'!B4&CHAR(10),\"\")&IF(COUNTIF('Eval 1'!E5,\"*moyen*\"),'Eval 1'!B5&CHAR(10),\"\")&IF(COUNTIF('Eval 1'!E6,\"*moyen*\"),'Eval 1'!B6&CHAR(10),\"\")&IF(COUNTIF('Eval 1'!E7,\"*moyen*\"),'Eval 1'!B7&CHAR(10),\"\")&IF(COUNTIF('Eval 1'!E9,\"*moyen*\"),'Eval 1'!B9&CHAR(10),\"\")&IF(COUNTIF('Eval 1'!E10,\"*moyen*\"),'Eval 1'!B10&CHAR(10),\"\")&IF(COUNTIF('Eval 1'!E8,\"*moyen*\"),'Eval 1'!B8,\"\")","v":""}]
[]
[]
["L'évaluation des moyens de maitrise selon l'autoévaluation du GREPHH:"]
[]
[null,null,"% objectifs atteints"]
[null,"Moyens",{"$f":"Rapport!G51","v":0}]
[]
[]
[]
["Les indicateurs de suivi sont:\nSuivi autoévaluation du GREPHH\nTaux de soignants formés dans les trois dernières années à l'hygiène des mains et la gestion des excréta "]
[]
[{"$f":"'Eval 1'!I12","v":"Taux de soignants formés à l'hygiène des mains dans les 3 dernières années"},null,{"$f":"'Eval 1'!L12","v":{"$error":"#DIV/0!"}}]
[{"$f":"'Eval 1'!I14","v":"Taux de soignants formés aux PS/Gestion des excréta dans les 3 dernières années"},null,{"$f":"'Eval 1'!L14","v":{"$error":"#DIV/0!"}}]
[]
[]
[]
[]
[]
[]
[]
[]
[]
[]
[]
[]
["Suivi des autres formations en lien avec le risque infectieux: cf. onglet 'Eval 1'"]
[]
["Autre indicateur de suivi:"]
[]
[]
[]
[]
["Le plan d'action prioritaire est:"]
[]
[{"$f":"IF('PLAN d''ACTION'!D6=\"\",\"\",'PLAN d''ACTION'!C6&CHAR(10))&IF('PLAN d''ACTION'!D7=\"\",\"\",'PLAN d''ACTION'!C7&CHAR(10))&IF('PLAN d''ACTION'!D8=\"\",\"\",'PLAN d''ACTION'!C8&CHAR(10))&IF('PLAN d''ACTION'!D9=\"\",\"\",'PLAN d''ACTION'!C9&CHAR(10))&IF('PLAN d''ACTION'!D10=\"\",\"\",'PLAN d''ACTION'!C10&CHAR(10))&IF('PLAN d''ACTION'!D11=\"\",\"\",'PLAN d''ACTION'!C11&CHAR(10))&IF('PLAN d''ACTION'!D12=\"\",\"\",'PLAN d''ACTION'!C12&CHAR(10))&IF('PLAN d''ACTION'!D13=\"\",\"\",'PLAN d''ACTION'!C13&CHAR(10))&IF('PLAN d''ACTION'!D14=\"\",\"\",'PLAN d''ACTION'!C14&CHAR(10))&IF('PLAN d''ACTION'!D15=\"\",\"\",'PLAN d''ACTION'!C15&CHAR(10))&IF('PLAN d''ACTION'!D16=\"\",\"\",'PLAN d''ACTION'!C16&CHAR(10))&IF('PLAN d''ACTION'!D17=\"\",\"\",'PLAN d''ACTION'!C17&CHAR(10))&IF('PLAN d''ACTION'!D18=\"\",\"\",'PLAN d''ACTION'!C18&CHAR(10))&IF('PLAN d''ACTION'!D19=\"\",\"\",'PLAN d''ACTION'!C19&CHAR(10))&IF('PLAN d''ACTION'!D20=\"\",\"\",'PLAN d''ACTION'!C20&CHAR(10))&IF('PLAN d''ACTION'!D21=\"\",\"\",'PLAN d''ACTION'!C21&CHAR(10))&IF('PLAN d''ACTION'!D22=\"\",\"\",'PLAN d''ACTION'!C22&CHAR(10))&IF('PLAN d''ACTION'!D23=\"\",\"\",'PLAN d''ACTION'!C23)","v":""}]
[]
["Le plan d'action prévoit également:"]
[]
[{"$f":"IF('PLAN d''ACTION'!E6=\"\",\"\",'PLAN d''ACTION'!C6&CHAR(10))&IF('PLAN d''ACTION'!E7=\"\",\"\",'PLAN d''ACTION'!C7&CHAR(10))&IF('PLAN d''ACTION'!E8=\"\",\"\",'PLAN d''ACTION'!C8&CHAR(10))&IF('PLAN d''ACTION'!E9=\"\",\"\",'PLAN d''ACTION'!C9&CHAR(10))&IF('PLAN d''ACTION'!E10=\"\",\"\",'PLAN d''ACTION'!C10&CHAR(10))&IF('PLAN d''ACTION'!E11=\"\",\"\",'PLAN d''ACTION'!C11&CHAR(10))&IF('PLAN d''ACTION'!E12=\"\",\"\",'PLAN d''ACTION'!C12&CHAR(10))&IF('PLAN d''ACTION'!E13=\"\",\"\",'PLAN d''ACTION'!C13&CHAR(10))&IF('PLAN d''ACTION'!E14=\"\",\"\",'PLAN d''ACTION'!C14&CHAR(10))&IF('PLAN d''ACTION'!E15=\"\",\"\",'PLAN d''ACTION'!C15&CHAR(10))&IF('PLAN d''ACTION'!E16=\"\",\"\",'PLAN d''ACTION'!C16&CHAR(10))&IF('PLAN d''ACTION'!E17=\"\",\"\",'PLAN d''ACTION'!C17&CHAR(10))&IF('PLAN d''ACTION'!E18=\"\",\"\",'PLAN d''ACTION'!C18&CHAR(10))&IF('PLAN d''ACTION'!E19=\"\",\"\",'PLAN d''ACTION'!C19&CHAR(10))&IF('PLAN d''ACTION'!E20=\"\",\"\",'PLAN d''ACTION'!C20&CHAR(10))&IF('PLAN d''ACTION'!E21=\"\",\"\",'PLAN d''ACTION'!C21&CHAR(10))&IF('PLAN d''ACTION'!E22=\"\",\"\",'PLAN d''ACTION'!C22&CHAR(10))&IF('PLAN d''ACTION'!E23=\"\",\"\",'PLAN d''ACTION'!C23&CHAR(10))&IF('PLAN d''ACTION'!F6=\"\",\"\",'PLAN d''ACTION'!C6&CHAR(10))&IF('PLAN d''ACTION'!F7=\"\",\"\",'PLAN d''ACTION'!C7&CHAR(10))&IF('PLAN d''ACTION'!F8=\"\",\"\",'PLAN d''ACTION'!C8&CHAR(10))&IF('PLAN d''ACTION'!F9=\"\",\"\",'PLAN d''ACTION'!C9&CHAR(10))&IF('PLAN d''ACTION'!F10=\"\",\"\",'PLAN d''ACTION'!C10&CHAR(10))&IF('PLAN d''ACTION'!F11=\"\",\"\",'PLAN d''ACTION'!C11&CHAR(10))&IF('PLAN d''ACTION'!F12=\"\",\"\",'PLAN d''ACTION'!C12&CHAR(10))&IF('PLAN d''ACTION'!F13=\"\",\"\",'PLAN d''ACTION'!C13&CHAR(10))&IF('PLAN d''ACTION'!F14=\"\",\"\",'PLAN d''ACTION'!C14&CHAR(10))&IF('PLAN d''ACTION'!F15=\"\",\"\",'PLAN d''ACTION'!C15&CHAR(10))&IF('PLAN d''ACTION'!F16=\"\",\"\",'PLAN d''ACTION'!C16&CHAR(10))&IF('PLAN d''ACTION'!F17=\"\",\"\",'PLAN d''ACTION'!C17&CHAR(10))&IF('PLAN d''ACTION'!F18=\"\",\"\",'PLAN d''ACTION'!C18&CHAR(10))&IF('PLAN d''ACTION'!F19=\"\",\"\",'PLAN d''ACTION'!C19&CHAR(10))&IF('PLAN d''ACTION'!F20=\"\",\"\",'PLAN d''ACTION'!C20&CHAR(10))&IF('PLAN d''ACTION'!F21=\"\",\"\",'PLAN d''ACTION'!C21&CHAR(10))&IF('PLAN d''ACTION'!F22=\"\",\"\",'PLAN d''ACTION'!C22&CHAR(10))&IF('PLAN d''ACTION'!F23=\"\",\"\",'PLAN d''ACTION'!C23)","v":""}]
[]
["Commentaire"]
[]
[]
[]
[]
[]
["I.2","Surveillance / Alerte / Indicateurs"]
[]
["Les points faibles prioritaires sont:"]
[]
[{"$f":"IF(C142<20,\"Défaut d'organisation de la surveillance du risque infectieux\"&CHAR(10),\"\")&IF(COUNTIF('Eval 1'!E11,\"*élevé*\"),'Eval 1'!B11&CHAR(10),\"\")&IF(COUNTIF('Eval 1'!E12,\"*élevé*\"),'Eval 1'!B12&CHAR(10),\"\")&IF(COUNTIF('Eval 1'!E13,\"*élevé*\"),'Eval 1'!B13&CHAR(10),\"\")&IF(COUNTIF('Eval 1'!E14,\"*élevé*\"),'Eval 1'!B14&CHAR(10),\"\")&IF(COUNTIF('Eval 1'!E15,\"*élevé*\"),'Eval 1'!B15&CHAR(10),\"\")&IF(COUNTIF('Eval 1'!E16,\"*élevé*\"),'Eval 1'!B16&CHAR(10),\"\")&IF(COUNTIF('Eval 1'!E17,\"*élevé*\"),'Eval 1'!B17&CHAR(10),\"\")&IF(COUNTIF('Eval 1'!E18,\"*élevé*\"),'Eval 1'!B18&CHAR(10),\"\")&IF(COUNTIF('Eval 1'!E19,\"*élevé*\"),'Eval 1'!B19,\"\")","v":"Défaut d'organisation de la surveillance du risque infectieux\n"}]
[]
["Les points à améliorer sont"]
[]
[{"$f":"IF(AND(C142>=20,C142<80),\"Organisation de la surveillance du risque infectieux à optimiser\"&CHAR(10),\"\")&IF(COUNTIF('Eval 1'!E11,\"*moyen*\"),'Eval 1'!B11&CHAR(10),\"\")&IF(COUNTIF('Eval 1'!E12,\"*moyen*\"),'Eval 1'!B12&CHAR(10),\"\")&IF(COUNTIF('Eval 1'!E13,\"*moyen*\"),'Eval 1'!B13&CHAR(10),\"\")&IF(COUNTIF('Eval 1'!E14,\"*moyen*\"),'Eval 1'!B14&CHAR(10),\"\")&IF(COUNTIF('Eval 1'!E15,\"*moyen*\"),'Eval 1'!B15&CHAR(10),\"\")&IF(COUNTIF('Eval 1'!E16,\"*moyen*\"),'Eval 1'!B16&CHAR(10),\"\")&IF(COUNTIF('Eval 1'!E17,\"*moyen*\"),'Eval 1'!B17&CHAR(10),\"\")&IF(COUNTIF('Eval 1'!E18,\"*moyen*\"),'Eval 1'!B18&CHAR(10),\"\")&IF(COUNTIF('Eval 1'!E19,\"*moyen*\"),'Eval 1'!B19,\"\")","v":""}]
[]
["L'évaluation des moyens de maitrise selon l'autoévaluation du GREPHH:"]
[]
[null,null,"% objectifs atteints"]
[null,"Surveillance / alerte / Indicateurs",{"$f":"Rapport!G52","v":0}]
[]
["Indicateurs de suivi:\nAutoévaluation GREPHH\nsuivi épidémiologique BMR"]
[]
[]
[]
[]
[]
[]
[]
[]
[]
[]
[]
[]
[]
["Le plan d'action prioritaire est:"]
[]
[{"$f":"IF('PLAN d''ACTION'!D24=\"\",\"\",'PLAN d''ACTION'!C24&CHAR(10))&IF('PLAN d''ACTION'!D25=\"\",\"\",'PLAN d''ACTION'!C25&CHAR(10))&IF('PLAN d''ACTION'!D26=\"\",\"\",'PLAN d''ACTION'!C26&CHAR(10))&IF('PLAN d''ACTION'!D27=\"\",\"\",'PLAN d''ACTION'!C27&CHAR(10))&IF('PLAN d''ACTION'!D28=\"\",\"\",'PLAN d''ACTION'!C28&CHAR(10))&IF('PLAN d''ACTION'!D29=\"\",\"\",'PLAN d''ACTION'!C29&CHAR(10))&IF('PLAN d''ACTION'!D30=\"\",\"\",'PLAN d''ACTION'!C30&CHAR(10))&IF('PLAN d''ACTION'!D31=\"\",\"\",'PLAN d''ACTION'!C31&CHAR(10))&IF('PLAN d''ACTION'!D32=\"\",\"\",'PLAN d''ACTION'!C32&CHAR(10))&IF('PLAN d''ACTION'!D33=\"\",\"\",'PLAN d''ACTION'!C33&CHAR(10))&IF('PLAN d''ACTION'!D34=\"\",\"\",'PLAN d''ACTION'!C34&CHAR(10))&IF('PLAN d''ACTION'!D35=\"\",\"\",'PLAN d''ACTION'!C35&CHAR(10))&IF('PLAN d''ACTION'!D36=\"\",\"\",'PLAN d''ACTION'!C36&CHAR(10))&IF('PLAN d''ACTION'!D37=\"\",\"\",'PLAN d''ACTION'!C37&CHAR(10))&IF('PLAN d''ACTION'!D38=\"\",\"\",'PLAN d''ACTION'!C38&CHAR(10))&IF('PLAN d''ACTION'!D39=\"\",\"\",'PLAN d''ACTION'!C39&CHAR(10))&IF('PLAN d''ACTION'!D40=\"\",\"\",'PLAN d''ACTION'!C40&CHAR(10))&IF('PLAN d''ACTION'!D41=\"\",\"\",'PLAN d''ACTION'!C41&CHAR(10))&IF('PLAN d''ACTION'!D42=\"\",\"\",'PLAN d''ACTION'!C42&CHAR(10))&IF('PLAN d''ACTION'!D43=\"\",\"\",'PLAN d''ACTION'!C43)","v":""}]
[]
["Le plan d'action prévoit également"]
[]
[{"$f":"IF('PLAN d''ACTION'!E24=\"\",\"\",'PLAN d''ACTION'!C24&CHAR(10))&IF('PLAN d''ACTION'!E25=\"\",\"\",'PLAN d''ACTION'!C25&CHAR(10))&IF('PLAN d''ACTION'!E26=\"\",\"\",'PLAN d''ACTION'!C26&CHAR(10))&IF('PLAN d''ACTION'!E27=\"\",\"\",'PLAN d''ACTION'!C27&CHAR(10))&IF('PLAN d''ACTION'!E28=\"\",\"\",'PLAN d''ACTION'!C28&CHAR(10))&IF('PLAN d''ACTION'!E29=\"\",\"\",'PLAN d''ACTION'!C29&CHAR(10))&IF('PLAN d''ACTION'!E30=\"\",\"\",'PLAN d''ACTION'!C30&CHAR(10))&IF('PLAN d''ACTION'!E31=\"\",\"\",'PLAN d''ACTION'!C31&CHAR(10))&IF('PLAN d''ACTION'!E32=\"\",\"\",'PLAN d''ACTION'!C32&CHAR(10))&IF('PLAN d''ACTION'!E33=\"\",\"\",'PLAN d''ACTION'!C33&CHAR(10))&IF('PLAN d''ACTION'!E34=\"\",\"\",'PLAN d''ACTION'!C34&CHAR(10))&IF('PLAN d''ACTION'!E35=\"\",\"\",'PLAN d''ACTION'!C35&CHAR(10))&IF('PLAN d''ACTION'!E36=\"\",\"\",'PLAN d''ACTION'!C36&CHAR(10))&IF('PLAN d''ACTION'!E37=\"\",\"\",'PLAN d''ACTION'!C37&CHAR(10))&IF('PLAN d''ACTION'!E38=\"\",\"\",'PLAN d''ACTION'!C38&CHAR(10))&IF('PLAN d''ACTION'!E39=\"\",\"\",'PLAN d''ACTION'!C39&CHAR(10))&IF('PLAN d''ACTION'!E40=\"\",\"\",'PLAN d''ACTION'!C40&CHAR(10))&IF('PLAN d''ACTION'!E41=\"\",\"\",'PLAN d''ACTION'!C41&CHAR(10))&IF('PLAN d''ACTION'!E42=\"\",\"\",'PLAN d''ACTION'!C42&CHAR(10))&IF('PLAN d''ACTION'!E43=\"\",\"\",'PLAN d''ACTION'!C43&CHAR(10))&IF('PLAN d''ACTION'!F24=\"\",\"\",'PLAN d''ACTION'!C24&CHAR(10))&IF('PLAN d''ACTION'!F25=\"\",\"\",'PLAN d''ACTION'!C25&CHAR(10))&IF('PLAN d''ACTION'!F26=\"\",\"\",'PLAN d''ACTION'!C26&CHAR(10))&IF('PLAN d''ACTION'!F27=\"\",\"\",'PLAN d''ACTION'!C27&CHAR(10))&IF('PLAN d''ACTION'!F28=\"\",\"\",'PLAN d''ACTION'!C28&CHAR(10))&IF('PLAN d''ACTION'!F29=\"\",\"\",'PLAN d''ACTION'!C29&CHAR(10))&IF('PLAN d''ACTION'!F30=\"\",\"\",'PLAN d''ACTION'!C30&CHAR(10))&IF('PLAN d''ACTION'!F31=\"\",\"\",'PLAN d''ACTION'!C31&CHAR(10))&IF('PLAN d''ACTION'!F32=\"\",\"\",'PLAN d''ACTION'!C32&CHAR(10))&IF('PLAN d''ACTION'!F33=\"\",\"\",'PLAN d''ACTION'!C33&CHAR(10))&IF('PLAN d''ACTION'!F34=\"\",\"\",'PLAN d''ACTION'!C34&CHAR(10))&IF('PLAN d''ACTION'!F35=\"\",\"\",'PLAN d''ACTION'!C35&CHAR(10))&IF('PLAN d''ACTION'!F36=\"\",\"\",'PLAN d''ACTION'!C36&CHAR(10))&IF('PLAN d''ACTION'!F37=\"\",\"\",'PLAN d''ACTION'!C37&CHAR(10))&IF('PLAN d''ACTION'!F38=\"\",\"\",'PLAN d''ACTION'!C38&CHAR(10))&IF('PLAN d''ACTION'!F39=\"\",\"\",'PLAN d''ACTION'!C39&CHAR(10))&IF('PLAN d''ACTION'!F40=\"\",\"\",'PLAN d''ACTION'!C40&CHAR(10))&IF('PLAN d''ACTION'!F41=\"\",\"\",'PLAN d''ACTION'!C41&CHAR(10))&IF('PLAN d''ACTION'!F42=\"\",\"\",'PLAN d''ACTION'!C42&CHAR(10))&IF('PLAN d''ACTION'!F43=\"\",\"\",'PLAN d''ACTION'!C43)","v":""}]
[]
["Commentaire"]
[]
[]
[]
[]
[]
[]
["I.3","Antibiotiques"]
[]
["Les points faibles prioritaires sont:"]
[]
[{"$f":"IF(C187<20,\"Défaut d'organisation pour la mise en oeuvre du bon usage des antibiotiques\"&CHAR(10),\"\")&IF(COUNTIF('Eval 1'!E20,\"*élevé*\"),'Eval 1'!B20&CHAR(10),\"\")&IF(COUNTIF('Eval 1'!E21,\"*élevé*\"),'Eval 1'!B21&CHAR(10),\"\")&IF(COUNTIF('Eval 1'!E22,\"*élevé*\"),'Eval 1'!B22&CHAR(10),\"\")&IF(COUNTIF('Eval 1'!E23,\"*élevé*\"),'Eval 1'!B23&CHAR(10),\"\")&IF(COUNTIF('Eval 1'!E24,\"*élevé*\"),'Eval 1'!B24&CHAR(10),\"\")&IF(COUNTIF('Eval 1'!E25,\"*élevé*\"),'Eval 1'!B25,\"\")","v":"Défaut d'organisation pour la mise en oeuvre du bon usage des antibiotiques\n"}]
[]
["Les points à améliorer sont"]
[]
[{"$f":"IF(AND(C187>=20,C187<80),\"Organisation pour la mise en oeuvre du bon usage des antibiotiques à optimiser\"&CHAR(10),\"\")&IF(COUNTIF('Eval 1'!E20,\"*moyen*\"),'Eval 1'!B20&CHAR(10),\"\")&IF(COUNTIF('Eval 1'!E21,\"*moyen*\"),'Eval 1'!B21&CHAR(10),\"\")&IF(COUNTIF('Eval 1'!E22,\"*moyen*\"),'Eval 1'!B22&CHAR(10),\"\")&IF(COUNTIF('Eval 1'!E23,\"*moyen*\"),'Eval 1'!B23&CHAR(10),\"\")&IF(COUNTIF('Eval 1'!E24,\"*moyen*\"),'Eval 1'!B24&CHAR(10),\"\")&IF(COUNTIF('Eval 1'!E25,\"*moyen*\"),'Eval 1'!B25,\"\")","v":""}]
[]
[]
["L'évaluation des moyens de maitrise selon l'autoévaluation du GREPHH:"]
[]
[null,null,"% objectifs atteints"]
[null,"Antibiotiques",{"$f":"Rapport!G53","v":0}]
[]
["Autre indicateur de suivi:"]
[]
[]
[]
[]
[]
["Le plan d'action prioritaire est:"]
[]
[{"$f":"IF('PLAN d''ACTION'!D44=\"\",\"\",'PLAN d''ACTION'!C44&CHAR(10))&IF('PLAN d''ACTION'!D45=\"\",\"\",'PLAN d''ACTION'!C45&CHAR(10))&IF('PLAN d''ACTION'!D46=\"\",\"\",'PLAN d''ACTION'!C46&CHAR(10))&IF('PLAN d''ACTION'!D47=\"\",\"\",'PLAN d''ACTION'!C47&CHAR(10))&IF('PLAN d''ACTION'!D48=\"\",\"\",'PLAN d''ACTION'!C48&CHAR(10))&IF('PLAN d''ACTION'!D49=\"\",\"\",'PLAN d''ACTION'!C49&CHAR(10))&IF('PLAN d''ACTION'!D50=\"\",\"\",'PLAN d''ACTION'!C50&CHAR(10))&IF('PLAN d''ACTION'!D51=\"\",\"\",'PLAN d''ACTION'!C51&CHAR(10))&IF('PLAN d''ACTION'!D52=\"\",\"\",'PLAN d''ACTION'!C52&CHAR(10))&IF('PLAN d''ACTION'!D53=\"\",\"\",'PLAN d''ACTION'!C53)","v":""}]
[]
["Le plan d'action prévoit également:"]
[]
[{"$f":"IF('PLAN d''ACTION'!E44=\"\",\"\",'PLAN d''ACTION'!C44&CHAR(10))&IF('PLAN d''ACTION'!E45=\"\",\"\",'PLAN d''ACTION'!C45&CHAR(10))&IF('PLAN d''ACTION'!E46=\"\",\"\",'PLAN d''ACTION'!C46&CHAR(10))&IF('PLAN d''ACTION'!E47=\"\",\"\",'PLAN d''ACTION'!C47&CHAR(10))&IF('PLAN d''ACTION'!E48=\"\",\"\",'PLAN d''ACTION'!C48&CHAR(10))&IF('PLAN d''ACTION'!E49=\"\",\"\",'PLAN d''ACTION'!C49&CHAR(10))&IF('PLAN d''ACTION'!E50=\"\",\"\",'PLAN d''ACTION'!C50&CHAR(10))&IF('PLAN d''ACTION'!E51=\"\",\"\",'PLAN d''ACTION'!C51&CHAR(10))&IF('PLAN d''ACTION'!E52=\"\",\"\",'PLAN d''ACTION'!C52&CHAR(10))&IF('PLAN d''ACTION'!E53=\"\",\"\",'PLAN d''ACTION'!C53&CHAR(10))&IF('PLAN d''ACTION'!F44=\"\",\"\",'PLAN d''ACTION'!C44&CHAR(10))&IF('PLAN d''ACTION'!F45=\"\",\"\",'PLAN d''ACTION'!C45&CHAR(10))&IF('PLAN d''ACTION'!F46=\"\",\"\",'PLAN d''ACTION'!C46&CHAR(10))&IF('PLAN d''ACTION'!F47=\"\",\"\",'PLAN d''ACTION'!C47&CHAR(10))&IF('PLAN d''ACTION'!F48=\"\",\"\",'PLAN d''ACTION'!C48&CHAR(10))&IF('PLAN d''ACTION'!F49=\"\",\"\",'PLAN d''ACTION'!C49&CHAR(10))&IF('PLAN d''ACTION'!F50=\"\",\"\",'PLAN d''ACTION'!C50&CHAR(10))&IF('PLAN d''ACTION'!F51=\"\",\"\",'PLAN d''ACTION'!C51&CHAR(10))&IF('PLAN d''ACTION'!F52=\"\",\"\",'PLAN d''ACTION'!C52&CHAR(10))&IF('PLAN d''ACTION'!F53=\"\",\"\",'PLAN d''ACTION'!C53)","v":""}]
[]
["Commentaire"]
[]
[]
[]
[]
[]
["I.4","Tenue du Personnel"]
[]
["Les points faibles prioritaires sont:"]
[]
[{"$f":"IF(C224<20,\"Défaut de prise en compte de la tenue du personnel dans la prévention du risque infectieux\"&CHAR(10),\"\")&IF(COUNTIF('Eval 1'!E26,\"*élevé*\"),'Eval 1'!B26&CHAR(10),\"\")&IF(COUNTIF('Eval 1'!E27,\"*élevé*\"),'Eval 1'!B27&CHAR(10),\"\")&IF(COUNTIF('Eval 1'!E28,\"*élevé*\"),'Eval 1'!B28&CHAR(10),\"\")&IF(COUNTIF('Eval 1'!E29,\"*élevé*\"),'Eval 1'!B29&CHAR(10),\"\")&IF(COUNTIF('Eval 1'!E30,\"*élevé*\"),'Eval 1'!B30,\"\")","v":"Défaut de prise en compte de la tenue du personnel dans la prévention du risque infectieux\n"}]
[]
["Les points à améliorer sont:"]
[]
[{"$f":"IF(AND(C224>=20,C224<80),\"Règles d'hygiène de tenue du personnel à améliorer\"&CHAR(10),\"\")&IF(COUNTIF('Eval 1'!E26,\"*moyen*\"),'Eval 1'!B26&CHAR(10),\"\")&IF(COUNTIF('Eval 1'!E27,\"*moyen*\"),'Eval 1'!B27&CHAR(10),\"\")&IF(COUNTIF('Eval 1'!E28,\"*moyen*\"),'Eval 1'!B28&CHAR(10),\"\")&IF(COUNTIF('Eval 1'!E29,\"*moyen*\"),'Eval 1'!B29&CHAR(10),\"\")&IF(COUNTIF('Eval 1'!E30,\"*moyen*\"),'Eval 1'!B30,\"\")","v":""}]
[]
[]
[]
["L'évaluation des moyens de maitrise selon l'autoévaluation du GREPHH:"]
[]
[null,null,"% objectifs atteints"]
[null,"Tenue",{"$f":"Rapport!G54","v":0}]
[]
["Autre indicateur de suivi:"]
[]
[]
[]
[]
["Le plan d'action prioritaire est:"]
[]
[{"$f":"IF('PLAN d''ACTION'!D54=\"\",\"\",'PLAN d''ACTION'!C54&CHAR(10))&IF('PLAN d''ACTION'!D55=\"\",\"\",'PLAN d''ACTION'!C55&CHAR(10))&IF('PLAN d''ACTION'!D56=\"\",\"\",'PLAN d''ACTION'!C56&CHAR(10))&IF('PLAN d''ACTION'!D57=\"\",\"\",'PLAN d''ACTION'!C57&CHAR(10))&IF('PLAN d''ACTION'!D58=\"\",\"\",'PLAN d''ACTION'!C58&CHAR(10))&IF('PLAN d''ACTION'!D59=\"\",\"\",'PLAN d''ACTION'!C59&CHAR(10))&IF('PLAN d''ACTION'!D60=\"\",\"\",'PLAN d''ACTION'!C60&CHAR(10))&IF('PLAN d''ACTION'!D61=\"\",\"\",'PLAN d''ACTION'!C61&CHAR(10))&IF('PLAN d''ACTION'!D62=\"\",\"\",'PLAN d''ACTION'!C62&CHAR(10))&IF('PLAN d''ACTION'!D63=\"\",\"\",'PLAN d''ACTION'!C63&CHAR(10))&IF('PLAN d''ACTION'!D64=\"\",\"\",'PLAN d''ACTION'!C64&CHAR(10))&IF('PLAN d''ACTION'!D65=\"\",\"\",'PLAN d''ACTION'!C65&CHAR(10))&IF('PLAN d''ACTION'!D66=\"\",\"\",'PLAN d''ACTION'!C66&CHAR(10))&IF('PLAN d''ACTION'!D68=\"\",\"\",'PLAN d''ACTION'!C68&CHAR(10))&IF('PLAN d''ACTION'!D69=\"\",\"\",'PLAN d''ACTION'!C69&CHAR(10))&IF('PLAN d''ACTION'!D70=\"\",\"\",'PLAN d''ACTION'!C70&CHAR(10))&IF('PLAN d''ACTION'!D67=\"\",\"\",'PLAN d''ACTION'!C67)","v":""}]
[]
["Le plan d'action prévoit également:"]
[]
[{"$f":"IF('PLAN d''ACTION'!E54=\"\",\"\",'PLAN d''ACTION'!C54&CHAR(10))&IF('PLAN d''ACTION'!E55=\"\",\"\",'PLAN d''ACTION'!C55&CHAR(10))&IF('PLAN d''ACTION'!E56=\"\",\"\",'PLAN d''ACTION'!C56&CHAR(10))&IF('PLAN d''ACTION'!E57=\"\",\"\",'PLAN d''ACTION'!C57&CHAR(10))&IF('PLAN d''ACTION'!E58=\"\",\"\",'PLAN d''ACTION'!C58&CHAR(10))&IF('PLAN d''ACTION'!E59=\"\",\"\",'PLAN d''ACTION'!C59&CHAR(10))&IF('PLAN d''ACTION'!E60=\"\",\"\",'PLAN d''ACTION'!C60&CHAR(10))&IF('PLAN d''ACTION'!E61=\"\",\"\",'PLAN d''ACTION'!C61&CHAR(10))&IF('PLAN d''ACTION'!E62=\"\",\"\",'PLAN d''ACTION'!C62&CHAR(10))&IF('PLAN d''ACTION'!E63=\"\",\"\",'PLAN d''ACTION'!C63&CHAR(10))&IF('PLAN d''ACTION'!E64=\"\",\"\",'PLAN d''ACTION'!C64&CHAR(10))&IF('PLAN d''ACTION'!E65=\"\",\"\",'PLAN d''ACTION'!C65&CHAR(10))&IF('PLAN d''ACTION'!E66=\"\",\"\",'PLAN d''ACTION'!C66&CHAR(10))&IF('PLAN d''ACTION'!E68=\"\",\"\",'PLAN d''ACTION'!C68&CHAR(10))&IF('PLAN d''ACTION'!E69=\"\",\"\",'PLAN d''ACTION'!C69&CHAR(10))&IF('PLAN d''ACTION'!E70=\"\",\"\",'PLAN d''ACTION'!C70&CHAR(10))&IF('PLAN d''ACTION'!E67=\"\",\"\",'PLAN d''ACTION'!C67&CHAR(10))&IF('PLAN d''ACTION'!F54=\"\",\"\",'PLAN d''ACTION'!C54&CHAR(10))&IF('PLAN d''ACTION'!F55=\"\",\"\",'PLAN d''ACTION'!C55&CHAR(10))&IF('PLAN d''ACTION'!F56=\"\",\"\",'PLAN d''ACTION'!C56&CHAR(10))&IF('PLAN d''ACTION'!F57=\"\",\"\",'PLAN d''ACTION'!C57&CHAR(10))&IF('PLAN d''ACTION'!F58=\"\",\"\",'PLAN d''ACTION'!C58&CHAR(10))&IF('PLAN d''ACTION'!F59=\"\",\"\",'PLAN d''ACTION'!C59&CHAR(10))&IF('PLAN d''ACTION'!F60=\"\",\"\",'PLAN d''ACTION'!C60&CHAR(10))&IF('PLAN d''ACTION'!F61=\"\",\"\",'PLAN d''ACTION'!C61&CHAR(10))&IF('PLAN d''ACTION'!F62=\"\",\"\",'PLAN d''ACTION'!C62&CHAR(10))&IF('PLAN d''ACTION'!F63=\"\",\"\",'PLAN d''ACTION'!C63&CHAR(10))&IF('PLAN d''ACTION'!F64=\"\",\"\",'PLAN d''ACTION'!C64&CHAR(10))&IF('PLAN d''ACTION'!F65=\"\",\"\",'PLAN d''ACTION'!C65&CHAR(10))&IF('PLAN d''ACTION'!F66=\"\",\"\",'PLAN d''ACTION'!C66&CHAR(10))&IF('PLAN d''ACTION'!F68=\"\",\"\",'PLAN d''ACTION'!C68&CHAR(10))&IF('PLAN d''ACTION'!F69=\"\",\"\",'PLAN d''ACTION'!C69&CHAR(10))&IF('PLAN d''ACTION'!F70=\"\",\"\",'PLAN d''ACTION'!C70&CHAR(10))&IF('PLAN d''ACTION'!F67=\"\",\"\",'PLAN d''ACTION'!C67)","v":""}]
[]
["Commentaire"]
[]
[]
[]
[]
[]
[]
[]
[]
[]
[]
[]
[]
[]
[]
[]
["Chapitre II","Gestion de l'environnement et des circuits"]
[]
[]
["L'évaluation des moyens de maitrise selon l'autoévaluation du GREPHH:"]
[]
[null,null,"% objectifs atteints"]
[null,"Environnement et circuits",{"$f":"Rapport!G25","v":3.8461538461538463}]
[]
[]
[]
[]
[]
[]
[]
[]
[]
[]
[]
[]
[]
[]
[]
[]
[]
[]
["II.1","Entretien des locaux"]
[]
[]
["Les risques prioritaires sont:"]
[]
[{"$f":"IF(C294<20,\"Défaut de procédure et/ou de moyen concernant l'entretien des locaux\"&CHAR(10),\"\")&IF(COUNTIF('Eval 2'!E4,\"*élevé*\"),'Eval 2'!B4&CHAR(10),\"\")&IF(COUNTIF('Eval 2'!E5,\"*élevé*\"),'Eval 2'!B5&CHAR(10),\"\")&IF(COUNTIF('Eval 2'!E6,\"*élevé*\"),'Eval 2'!B6&CHAR(10),\"\")&IF(COUNTIF('Eval 2'!E7,\"*élevé*\"),'Eval 2'!B7&CHAR(10),\"\")&IF(COUNTIF('Eval 2'!E8,\"*élevé*\"),'Eval 2'!B8&CHAR(10),\"\")&IF(COUNTIF('Eval 2'!E9,\"*élevé*\"),'Eval 2'!B9,\"\")","v":"Défaut de procédure et/ou de moyen concernant l'entretien des locaux\n"}]
[]
["Les risques à prendre en compte sont:"]
[]
[{"$f":"IF(AND(C294>=20,C294<80),\"Procédures et/ou moyens concernant l'entretien des locaux à améliorer\"&CHAR(10),\"\")&IF(COUNTIF('Eval 2'!E4,\"*moyen*\"),'Eval 2'!B4&CHAR(10),\"\")&IF(COUNTIF('Eval 2'!E5,\"*moyen*\"),'Eval 2'!B5&CHAR(10),\"\")&IF(COUNTIF('Eval 2'!E6,\"*moyen*\"),'Eval 2'!B6&CHAR(10),\"\")&IF(COUNTIF('Eval 2'!E7,\"*moyen*\"),'Eval 2'!B7&CHAR(10),\"\")&IF(COUNTIF('Eval 2'!E8,\"*moyen*\"),'Eval 2'!B8&CHAR(10),\"\")&IF(COUNTIF('Eval 2'!E9,\"*moyen*\"),'Eval 2'!B9,\"\")","v":""}]
[]
["L'évaluation des moyens de maitrise selon l'autoévaluation du GREPHH:"]
[]
[null,null,"% objectifs atteints"]
[null,"Entretien des locaux",{"$f":"Rapport!G68","v":0}]
[]
["Indicateurs de suivi:\nAutoévaluation du GREPHH"]
[]
["Autre indicateur de suivi:"]
[]
[]
[]
[]
[]
["Le plan d'action prioritaire est:"]
[]
[{"$f":"IF('PLAN d''ACTION'!D73=\"\",\"\",'PLAN d''ACTION'!C73&CHAR(10))&IF('PLAN d''ACTION'!D74=\"\",\"\",'PLAN d''ACTION'!C74&CHAR(10))&IF('PLAN d''ACTION'!D75=\"\",\"\",'PLAN d''ACTION'!C75&CHAR(10))&IF('PLAN d''ACTION'!D76=\"\",\"\",'PLAN d''ACTION'!C76&CHAR(10))&IF('PLAN d''ACTION'!D77=\"\",\"\",'PLAN d''ACTION'!C77&CHAR(10))&IF('PLAN d''ACTION'!D78=\"\",\"\",'PLAN d''ACTION'!C78&CHAR(10))&IF('PLAN d''ACTION'!D79=\"\",\"\",'PLAN d''ACTION'!C79&CHAR(10))&IF('PLAN d''ACTION'!D80=\"\",\"\",'PLAN d''ACTION'!C80&CHAR(10))&IF('PLAN d''ACTION'!D81=\"\",\"\",'PLAN d''ACTION'!C81&CHAR(10))&IF('PLAN d''ACTION'!D82=\"\",\"\",'PLAN d''ACTION'!C82&CHAR(10))&IF('PLAN d''ACTION'!D83=\"\",\"\",'PLAN d''ACTION'!C83&CHAR(10))&IF('PLAN d''ACTION'!D84=\"\",\"\",'PLAN d''ACTION'!C84&CHAR(10))&IF('PLAN d''ACTION'!D85=\"\",\"\",'PLAN d''ACTION'!C85&CHAR(10))&IF('PLAN d''ACTION'!D86=\"\",\"\",'PLAN d''ACTION'!C86&CHAR(10))&IF('PLAN d''ACTION'!D87=\"\",\"\",'PLAN d''ACTION'!C87&CHAR(10))&IF('PLAN d''ACTION'!D88=\"\",\"\",'PLAN d''ACTION'!C88&CHAR(10))&IF('PLAN d''ACTION'!D89=\"\",\"\",'PLAN d''ACTION'!C89&CHAR(10))&IF('PLAN d''ACTION'!D90=\"\",\"\",'PLAN d''ACTION'!C90&CHAR(10))&IF('PLAN d''ACTION'!D91=\"\",\"\",'PLAN d''ACTION'!C91&CHAR(10))&IF('PLAN d''ACTION'!D92=\"\",\"\",'PLAN d''ACTION'!C92&CHAR(10))&IF('PLAN d''ACTION'!D93=\"\",\"\",'PLAN d''ACTION'!C93&CHAR(10))&IF('PLAN d''ACTION'!D94=\"\",\"\",'PLAN d''ACTION'!C94&CHAR(10))&IF('PLAN d''ACTION'!D95=\"\",\"\",'PLAN d''ACTION'!C95&CHAR(10))&IF('PLAN d''ACTION'!D96=\"\",\"\",'PLAN d''ACTION'!C96&CHAR(10))&IF('PLAN d''ACTION'!D97=\"\",\"\",'PLAN d''ACTION'!C97&CHAR(10))&IF('PLAN d''ACTION'!D98=\"\",\"\",'PLAN d''ACTION'!C98&CHAR(10))&IF('PLAN d''ACTION'!D99=\"\",\"\",'PLAN d''ACTION'!C99)","v":""}]
[]
["Le plan d'action prévoit également:"]
[]
[{"$f":"IF('PLAN d''ACTION'!E73=\"\",\"\",'PLAN d''ACTION'!C73&CHAR(10))&IF('PLAN d''ACTION'!E74=\"\",\"\",'PLAN d''ACTION'!C74&CHAR(10))&IF('PLAN d''ACTION'!E75=\"\",\"\",'PLAN d''ACTION'!C75&CHAR(10))&IF('PLAN d''ACTION'!E76=\"\",\"\",'PLAN d''ACTION'!C76&CHAR(10))&IF('PLAN d''ACTION'!E77=\"\",\"\",'PLAN d''ACTION'!C77&CHAR(10))&IF('PLAN d''ACTION'!E78=\"\",\"\",'PLAN d''ACTION'!C78&CHAR(10))&IF('PLAN d''ACTION'!E79=\"\",\"\",'PLAN d''ACTION'!C79&CHAR(10))&IF('PLAN d''ACTION'!E80=\"\",\"\",'PLAN d''ACTION'!C80&CHAR(10))&IF('PLAN d''ACTION'!E81=\"\",\"\",'PLAN d''ACTION'!C81&CHAR(10))&IF('PLAN d''ACTION'!E82=\"\",\"\",'PLAN d''ACTION'!C82&CHAR(10))&IF('PLAN d''ACTION'!E83=\"\",\"\",'PLAN d''ACTION'!C83&CHAR(10))&IF('PLAN d''ACTION'!E84=\"\",\"\",'PLAN d''ACTION'!C84&CHAR(10))&IF('PLAN d''ACTION'!E98=\"\",\"\",'PLAN d''ACTION'!C98&CHAR(10))&IF('PLAN d''ACTION'!E94=\"\",\"\",'PLAN d''ACTION'!C94&CHAR(10))&IF('PLAN d''ACTION'!E85=\"\",\"\",'PLAN d''ACTION'!C85&CHAR(10))&IF('PLAN d''ACTION'!E86=\"\",\"\",'PLAN d''ACTION'!C86&CHAR(10))&IF('PLAN d''ACTION'!E87=\"\",\"\",'PLAN d''ACTION'!C87&CHAR(10))&IF('PLAN d''ACTION'!E88=\"\",\"\",'PLAN d''ACTION'!C88&CHAR(10))&IF('PLAN d''ACTION'!E96=\"\",\"\",'PLAN d''ACTION'!C96&CHAR(10))&IF('PLAN d''ACTION'!E95=\"\",\"\",'PLAN d''ACTION'!C95&CHAR(10))&IF('PLAN d''ACTION'!E89=\"\",\"\",'PLAN d''ACTION'!C89&CHAR(10))&IF('PLAN d''ACTION'!E90=\"\",\"\",'PLAN d''ACTION'!C90&CHAR(10))&IF('PLAN d''ACTION'!E91=\"\",\"\",'PLAN d''ACTION'!C91&CHAR(10))&IF('PLAN d''ACTION'!E92=\"\",\"\",'PLAN d''ACTION'!C92&CHAR(10))&IF('PLAN d''ACTION'!E93=\"\",\"\",'PLAN d''ACTION'!C93&CHAR(10))&IF('PLAN d''ACTION'!E97=\"\",\"\",'PLAN d''ACTION'!C97&CHAR(10))&IF('PLAN d''ACTION'!E99=\"\",\"\",'PLAN d''ACTION'!C99&CHAR(10))&IF('PLAN d''ACTION'!F73=\"\",\"\",'PLAN d''ACTION'!C73&CHAR(10))&IF('PLAN d''ACTION'!F74=\"\",\"\",'PLAN d''ACTION'!C74&CHAR(10))&IF('PLAN d''ACTION'!F75=\"\",\"\",'PLAN d''ACTION'!C75&CHAR(10))&IF('PLAN d''ACTION'!F76=\"\",\"\",'PLAN d''ACTION'!C76&CHAR(10))&IF('PLAN d''ACTION'!F77=\"\",\"\",'PLAN d''ACTION'!C77&CHAR(10))&IF('PLAN d''ACTION'!F78=\"\",\"\",'PLAN d''ACTION'!C78&CHAR(10))&IF('PLAN d''ACTION'!F79=\"\",\"\",'PLAN d''ACTION'!C79&CHAR(10))&IF('PLAN d''ACTION'!F80=\"\",\"\",'PLAN d''ACTION'!C80&CHAR(10))&IF('PLAN d''ACTION'!F81=\"\",\"\",'PLAN d''ACTION'!C81&CHAR(10))&IF('PLAN d''ACTION'!F82=\"\",\"\",'PLAN d''ACTION'!C82&CHAR(10))&IF('PLAN d''ACTION'!F83=\"\",\"\",'PLAN d''ACTION'!C83&CHAR(10))&IF('PLAN d''ACTION'!F84=\"\",\"\",'PLAN d''ACTION'!C84&CHAR(10))&IF('PLAN d''ACTION'!F98=\"\",\"\",'PLAN d''ACTION'!C98&CHAR(10))&IF('PLAN d''ACTION'!F94=\"\",\"\",'PLAN d''ACTION'!C94&CHAR(10))&IF('PLAN d''ACTION'!F85=\"\",\"\",'PLAN d''ACTION'!C85&CHAR(10))&IF('PLAN d''ACTION'!F86=\"\",\"\",'PLAN d''ACTION'!C86&CHAR(10))&IF('PLAN d''ACTION'!F87=\"\",\"\",'PLAN d''ACTION'!C87&CHAR(10))&IF('PLAN d''ACTION'!F88=\"\",\"\",'PLAN d''ACTION'!C88&CHAR(10))&IF('PLAN d''ACTION'!F96=\"\",\"\",'PLAN d''ACTION'!C96&CHAR(10))&IF('PLAN d''ACTION'!F95=\"\",\"\",'PLAN d''ACTION'!C95&CHAR(10))&IF('PLAN d''ACTION'!F89=\"\",\"\",'PLAN d''ACTION'!C89&CHAR(10))&IF('PLAN d''ACTION'!F90=\"\",\"\",'PLAN d''ACTION'!C90&CHAR(10))&IF('PLAN d''ACTION'!F91=\"\",\"\",'PLAN d''ACTION'!C91&CHAR(10))&IF('PLAN d''ACTION'!F92=\"\",\"\",'PLAN d''ACTION'!C92&CHAR(10))&IF('PLAN d''ACTION'!F93=\"\",\"\",'PLAN d''ACTION'!C93&CHAR(10))&IF('PLAN d''ACTION'!F97=\"\",\"\",'PLAN d''ACTION'!C97&CHAR(10))&IF('PLAN d''ACTION'!F99=\"\",\"\",'PLAN d''ACTION'!C99)","v":""}]
[]
[]
["Commentaire"]
[]
[]
[]
[]
[]
["II.2","Hygiène en restauration"]
[]
[]
["Les points faibles prioritaires sont:"]
[]
[{"$f":"IF(C333<20,\"Défaut de maitrise du risque infectieux concernant l'hygiène en restauration\"&CHAR(10),\"\")&IF(COUNTIF('Eval 2'!E10,\"*élevé*\"),'Eval 2'!B10&CHAR(10),\"\")&IF(COUNTIF('Eval 2'!E11,\"*élevé*\"),'Eval 2'!B11&CHAR(10),\"\")&IF(COUNTIF('Eval 2'!E12,\"*élevé*\"),'Eval 2'!B12&CHAR(10),\"\")&IF(COUNTIF('Eval 2'!E13,\"*élevé*\"),'Eval 2'!B13,\"\")","v":"Défaut de maitrise du risque infectieux concernant l'hygiène en restauration\n"}]
[]
["Les points à améliorer sont:"]
[]
[{"$f":"IF(AND(C333>=20,C333<80),\"Maitrise du risque infectieux concernant l'hygiène en restauration à optimiser\"&CHAR(10),\"\")&IF(COUNTIF('Eval 2'!E10,\"*moyen*\"),'Eval 2'!B10&CHAR(10),\"\")&IF(COUNTIF('Eval 2'!E11,\"*moyen*\"),'Eval 2'!B11&CHAR(10),\"\")&IF(COUNTIF('Eval 2'!E12,\"*moyen*\"),'Eval 2'!B12&CHAR(10),\"\")&IF(COUNTIF('Eval 2'!E13,\"*moyen*\"),'Eval 2'!B13,\"\")","v":""}]
[]
["L'évaluation des moyens de maitrise selon l'autoévaluation du GREPHH:"]
[]
[null,null,"% objectifs atteints"]
[null,"Hygiène en restauration",{"$f":"Rapport!G69","v":0}]
[]
["Indicateurs de suivi:\nAutoévaluation GREPHH\nsuivi épidémiologique TIAC (onglet 'Eval 6')"]
[]
[]
["Le plan d'action prioritaire est:"]
[]
[{"$f":"IF('PLAN d''ACTION'!D100=\"\",\"\",'PLAN d''ACTION'!C100&CHAR(10))&IF('PLAN d''ACTION'!D101=\"\",\"\",'PLAN d''ACTION'!C101&CHAR(10))&IF('PLAN d''ACTION'!D102=\"\",\"\",'PLAN d''ACTION'!C102&CHAR(10))&IF('PLAN d''ACTION'!D103=\"\",\"\",'PLAN d''ACTION'!C103&CHAR(10))&IF('PLAN d''ACTION'!D104=\"\",\"\",'PLAN d''ACTION'!C104&CHAR(10))&IF('PLAN d''ACTION'!D105=\"\",\"\",'PLAN d''ACTION'!C105&CHAR(10))&IF('PLAN d''ACTION'!D106=\"\",\"\",'PLAN d''ACTION'!C106&CHAR(10))&IF('PLAN d''ACTION'!D107=\"\",\"\",'PLAN d''ACTION'!C107&CHAR(10))&IF('PLAN d''ACTION'!D108=\"\",\"\",'PLAN d''ACTION'!C108&CHAR(10))&IF('PLAN d''ACTION'!D109=\"\",\"\",'PLAN d''ACTION'!C109&CHAR(10))&IF('PLAN d''ACTION'!D110=\"\",\"\",'PLAN d''ACTION'!C110&CHAR(10))&IF('PLAN d''ACTION'!D111=\"\",\"\",'PLAN d''ACTION'!C111&CHAR(10))&IF('PLAN d''ACTION'!D112=\"\",\"\",'PLAN d''ACTION'!C112&CHAR(10))&IF('PLAN d''ACTION'!D113=\"\",\"\",'PLAN d''ACTION'!C113&CHAR(10))&IF('PLAN d''ACTION'!D114=\"\",\"\",'PLAN d''ACTION'!C114&CHAR(10))&IF('PLAN d''ACTION'!D115=\"\",\"\",'PLAN d''ACTION'!C115&CHAR(10))&IF('PLAN d''ACTION'!D116=\"\",\"\",'PLAN d''ACTION'!C116&CHAR(10))&IF('PLAN d''ACTION'!D117=\"\",\"\",'PLAN d''ACTION'!C117&CHAR(10))&IF('PLAN d''ACTION'!D118=\"\",\"\",'PLAN d''ACTION'!C118&CHAR(10))&IF('PLAN d''ACTION'!D119=\"\",\"\",'PLAN d''ACTION'!C119&CHAR(10))&IF('PLAN d''ACTION'!D120=\"\",\"\",'PLAN d''ACTION'!C120&CHAR(10))&IF('PLAN d''ACTION'!D121=\"\",\"\",'PLAN d''ACTION'!C121&CHAR(10))&IF('PLAN d''ACTION'!D122=\"\",\"\",'PLAN d''ACTION'!C122&CHAR(10))&IF('PLAN d''ACTION'!D123=\"\",\"\",'PLAN d''ACTION'!C123)","v":""}]
[]
["Le plan d'action prévoit également:"]
[]
[{"$f":"IF('PLAN d''ACTION'!E100=\"\",\"\",'PLAN d''ACTION'!C100&CHAR(10))&IF('PLAN d''ACTION'!E101=\"\",\"\",'PLAN d''ACTION'!C101&CHAR(10))&IF('PLAN d''ACTION'!E102=\"\",\"\",'PLAN d''ACTION'!C102&CHAR(10))&IF('PLAN d''ACTION'!E103=\"\",\"\",'PLAN d''ACTION'!C103&CHAR(10))&IF('PLAN d''ACTION'!E104=\"\",\"\",'PLAN d''ACTION'!C104&CHAR(10))&IF('PLAN d''ACTION'!E105=\"\",\"\",'PLAN d''ACTION'!C105&CHAR(10))&IF('PLAN d''ACTION'!E106=\"\",\"\",'PLAN d''ACTION'!C106&CHAR(10))&IF('PLAN d''ACTION'!E107=\"\",\"\",'PLAN d''ACTION'!C107&CHAR(10))&IF('PLAN d''ACTION'!E108=\"\",\"\",'PLAN d''ACTION'!C108&CHAR(10))&IF('PLAN d''ACTION'!E109=\"\",\"\",'PLAN d''ACTION'!C109&CHAR(10))&IF('PLAN d''ACTION'!E110=\"\",\"\",'PLAN d''ACTION'!C110&CHAR(10))&IF('PLAN d''ACTION'!E111=\"\",\"\",'PLAN d''ACTION'!C111&CHAR(10))&IF('PLAN d''ACTION'!E112=\"\",\"\",'PLAN d''ACTION'!C112&CHAR(10))&IF('PLAN d''ACTION'!E113=\"\",\"\",'PLAN d''ACTION'!C113&CHAR(10))&IF('PLAN d''ACTION'!E114=\"\",\"\",'PLAN d''ACTION'!C114&CHAR(10))&IF('PLAN d''ACTION'!E115=\"\",\"\",'PLAN d''ACTION'!C115&CHAR(10))&IF('PLAN d''ACTION'!E116=\"\",\"\",'PLAN d''ACTION'!C116&CHAR(10))&IF('PLAN d''ACTION'!E117=\"\",\"\",'PLAN d''ACTION'!C117&CHAR(10))&IF('PLAN d''ACTION'!E118=\"\",\"\",'PLAN d''ACTION'!C118&CHAR(10))&IF('PLAN d''ACTION'!E119=\"\",\"\",'PLAN d''ACTION'!C119&CHAR(10))&IF('PLAN d''ACTION'!E120=\"\",\"\",'PLAN d''ACTION'!C120&CHAR(10))&IF('PLAN d''ACTION'!E121=\"\",\"\",'PLAN d''ACTION'!C121&CHAR(10))&IF('PLAN d''ACTION'!E122=\"\",\"\",'PLAN d''ACTION'!C122&CHAR(10))&IF('PLAN d''ACTION'!E123=\"\",\"\",'PLAN d''ACTION'!C123&CHAR(10))&IF('PLAN d''ACTION'!F100=\"\",\"\",'PLAN d''ACTION'!C100&CHAR(10))&IF('PLAN d''ACTION'!F101=\"\",\"\",'PLAN d''ACTION'!C101&CHAR(10))&IF('PLAN d''ACTION'!F102=\"\",\"\",'PLAN d''ACTION'!C102&CHAR(10))&IF('PLAN d''ACTION'!F103=\"\",\"\",'PLAN d''ACTION'!C103&CHAR(10))&IF('PLAN d''ACTION'!F104=\"\",\"\",'PLAN d''ACTION'!C104&CHAR(10))&IF('PLAN d''ACTION'!F105=\"\",\"\",'PLAN d''ACTION'!C105&CHAR(10))&IF('PLAN d''ACTION'!F106=\"\",\"\",'PLAN d''ACTION'!C106&CHAR(10))&IF('PLAN d''ACTION'!F107=\"\",\"\",'PLAN d''ACTION'!C107&CHAR(10))&IF('PLAN d''ACTION'!F108=\"\",\"\",'PLAN d''ACTION'!C108&CHAR(10))&IF('PLAN d''ACTION'!F109=\"\",\"\",'PLAN d''ACTION'!C109&CHAR(10))&IF('PLAN d''ACTION'!F110=\"\",\"\",'PLAN d''ACTION'!C110&CHAR(10))&IF('PLAN d''ACTION'!F111=\"\",\"\",'PLAN d''ACTION'!C111&CHAR(10))&IF('PLAN d''ACTION'!F112=\"\",\"\",'PLAN d''ACTION'!C112&CHAR(10))&IF('PLAN d''ACTION'!F113=\"\",\"\",'PLAN d''ACTION'!C113&CHAR(10))&IF('PLAN d''ACTION'!F114=\"\",\"\",'PLAN d''ACTION'!C114&CHAR(10))&IF('PLAN d''ACTION'!F115=\"\",\"\",'PLAN d''ACTION'!C115&CHAR(10))&IF('PLAN d''ACTION'!F116=\"\",\"\",'PLAN d''ACTION'!C116&CHAR(10))&IF('PLAN d''ACTION'!F117=\"\",\"\",'PLAN d''ACTION'!C117&CHAR(10))&IF('PLAN d''ACTION'!F118=\"\",\"\",'PLAN d''ACTION'!C118&CHAR(10))&IF('PLAN d''ACTION'!F119=\"\",\"\",'PLAN d''ACTION'!C119&CHAR(10))&IF('PLAN d''ACTION'!F120=\"\",\"\",'PLAN d''ACTION'!C120&CHAR(10))&IF('PLAN d''ACTION'!F121=\"\",\"\",'PLAN d''ACTION'!C121&CHAR(10))&IF('PLAN d''ACTION'!F122=\"\",\"\",'PLAN d''ACTION'!C122&CHAR(10))&IF('PLAN d''ACTION'!F123=\"\",\"\",'PLAN d''ACTION'!C123)","v":""}]
[]
[]
[]
["Commentaire"]
[]
[]
[]
[]
[]
["II.3","Gestion du linge"]
[]
[]
["Les points faibles prioritaires sont:"]
[]
[{"$f":"IF(C368<20,\"Défaut de procédure et/ou organisation concernant le circuit du linge\"&CHAR(10),\"\")&IF(COUNTIF('Eval 2'!E19,\"*élevé*\"),'Eval 2'!B19&CHAR(10),\"\")&IF(COUNTIF('Eval 2'!E20,\"*élevé*\"),'Eval 2'!B20&CHAR(10),\"\")&IF(COUNTIF('Eval 2'!E21,\"*élevé*\"),'Eval 2'!B21&CHAR(10),\"\")&IF(COUNTIF('Eval 2'!E22,\"*élevé*\"),'Eval 2'!B22&CHAR(10),\"\")&IF(COUNTIF('Eval 2'!E23,\"*élevé*\"),'Eval 2'!B23&CHAR(10),\"\")&IF(COUNTIF('Eval 2'!E24,\"*élevé*\"),'Eval 2'!B24,\"\")","v":""}]
[]
["Les points à améliorer sont:"]
[]
[{"$f":"IF(AND(C368>=20,C368<80),\"Gestion du circuit du linge à optimiser\"&CHAR(10),\"\")&IF(COUNTIF('Eval 2'!E19,\"*moyen*\"),'Eval 2'!B19&CHAR(10),\"\")&IF(COUNTIF('Eval 2'!E20,\"*moyen*\"),'Eval 2'!B20&CHAR(10),\"\")&IF(COUNTIF('Eval 2'!E21,\"*moyen*\"),'Eval 2'!B21&CHAR(10),\"\")&IF(COUNTIF('Eval 2'!E22,\"*moyen*\"),'Eval 2'!B22&CHAR(10),\"\")&IF(COUNTIF('Eval 2'!E23,\"*moyen*\"),'Eval 2'!B23&CHAR(10),\"\")&IF(COUNTIF('Eval 2'!E24,\"*moyen*\"),'Eval 2'!B24,\"\")","v":"Gestion du circuit du linge à optimiser\n"}]
[]
["L'évaluation des moyens de maitrise selon l'autoévaluation du GREPHH:"]
[]
[null,null,"% objectifs atteints"]
[null,"Linge",{"$f":"Rapport!G70","v":30}]
[]
["Indicateurs de suivi: \nAutoévaluation du GREPHH"]
[]
["Autre indicateur de suivi:"]
[]
[]
[]
[]
[]
["Le plan d'action prévoit de façon prioritaire:"]
[]
[{"$f":"IF('PLAN d''ACTION'!D124=\"\",\"\",'PLAN d''ACTION'!C124&CHAR(10))&IF('PLAN d''ACTION'!D125=\"\",\"\",'PLAN d''ACTION'!C125&CHAR(10))&IF('PLAN d''ACTION'!D126=\"\",\"\",'PLAN d''ACTION'!C126&CHAR(10))&IF('PLAN d''ACTION'!D127=\"\",\"\",'PLAN d''ACTION'!C127&CHAR(10))&IF('PLAN d''ACTION'!D128=\"\",\"\",'PLAN d''ACTION'!C128&CHAR(10))&IF('PLAN d''ACTION'!D129=\"\",\"\",'PLAN d''ACTION'!C129&CHAR(10))&IF('PLAN d''ACTION'!D130=\"\",\"\",'PLAN d''ACTION'!C130&CHAR(10))&IF('PLAN d''ACTION'!D131=\"\",\"\",'PLAN d''ACTION'!C131&CHAR(10))&IF('PLAN d''ACTION'!D132=\"\",\"\",'PLAN d''ACTION'!C132&CHAR(10))&IF('PLAN d''ACTION'!D133=\"\",\"\",'PLAN d''ACTION'!C133&CHAR(10))&IF('PLAN d''ACTION'!D134=\"\",\"\",'PLAN d''ACTION'!C134&CHAR(10))&IF('PLAN d''ACTION'!D135=\"\",\"\",'PLAN d''ACTION'!C135&CHAR(10))&IF('PLAN d''ACTION'!D136=\"\",\"\",'PLAN d''ACTION'!C136&CHAR(10))&IF('PLAN d''ACTION'!D137=\"\",\"\",'PLAN d''ACTION'!C137&CHAR(10))&IF('PLAN d''ACTION'!D138=\"\",\"\",'PLAN d''ACTION'!C138&CHAR(10))&IF('PLAN d''ACTION'!D139=\"\",\"\",'PLAN d''ACTION'!C139&CHAR(10))&IF('PLAN d''ACTION'!D140=\"\",\"\",'PLAN d''ACTION'!C140&CHAR(10))&IF('PLAN d''ACTION'!D141=\"\",\"\",'PLAN d''ACTION'!C141&CHAR(10))&IF('PLAN d''ACTION'!D142=\"\",\"\",'PLAN d''ACTION'!C142&CHAR(10))&IF('PLAN d''ACTION'!D143=\"\",\"\",'PLAN d''ACTION'!C143&CHAR(10))&IF('PLAN d''ACTION'!D144=\"\",\"\",'PLAN d''ACTION'!C144&CHAR(10))&IF('PLAN d''ACTION'!D145=\"\",\"\",'PLAN d''ACTION'!C145&CHAR(10))&IF('PLAN d''ACTION'!D146=\"\",\"\",'PLAN d''ACTION'!C146&CHAR(10))&IF('PLAN d''ACTION'!D147=\"\",\"\",'PLAN d''ACTION'!C147&CHAR(10))&IF('PLAN d''ACTION'!D148=\"\",\"\",'PLAN d''ACTION'!C148&CHAR(10))&IF('PLAN d''ACTION'!D149=\"\",\"\",'PLAN d''ACTION'!C149&CHAR(10))&IF('PLAN d''ACTION'!D150=\"\",\"\",'PLAN d''ACTION'!C150)","v":""}]
[]
["Le plan d'action prévoit également:"]
[]
[{"$f":"IF('PLAN d''ACTION'!E124=\"\",\"\",'PLAN d''ACTION'!C124&CHAR(10))&IF('PLAN d''ACTION'!E125=\"\",\"\",'PLAN d''ACTION'!C125&CHAR(10))&IF('PLAN d''ACTION'!E126=\"\",\"\",'PLAN d''ACTION'!C126&CHAR(10))&IF('PLAN d''ACTION'!E127=\"\",\"\",'PLAN d''ACTION'!C127&CHAR(10))&IF('PLAN d''ACTION'!E128=\"\",\"\",'PLAN d''ACTION'!C128&CHAR(10))&IF('PLAN d''ACTION'!E129=\"\",\"\",'PLAN d''ACTION'!C129&CHAR(10))&IF('PLAN d''ACTION'!E130=\"\",\"\",'PLAN d''ACTION'!C130&CHAR(10))&IF('PLAN d''ACTION'!E131=\"\",\"\",'PLAN d''ACTION'!C131&CHAR(10))&IF('PLAN d''ACTION'!E132=\"\",\"\",'PLAN d''ACTION'!C132&CHAR(10))&IF('PLAN d''ACTION'!E133=\"\",\"\",'PLAN d''ACTION'!C133&CHAR(10))&IF('PLAN d''ACTION'!E134=\"\",\"\",'PLAN d''ACTION'!C134&CHAR(10))&IF('PLAN d''ACTION'!E135=\"\",\"\",'PLAN d''ACTION'!C135&CHAR(10))&IF('PLAN d''ACTION'!E136=\"\",\"\",'PLAN d''ACTION'!C136&CHAR(10))&IF('PLAN d''ACTION'!E137=\"\",\"\",'PLAN d''ACTION'!C137&CHAR(10))&IF('PLAN d''ACTION'!E138=\"\",\"\",'PLAN d''ACTION'!C138&CHAR(10))&IF('PLAN d''ACTION'!E139=\"\",\"\",'PLAN d''ACTION'!C139&CHAR(10))&IF('PLAN d''ACTION'!E140=\"\",\"\",'PLAN d''ACTION'!C140&CHAR(10))&IF('PLAN d''ACTION'!E141=\"\",\"\",'PLAN d''ACTION'!C141&CHAR(10))&IF('PLAN d''ACTION'!E142=\"\",\"\",'PLAN d''ACTION'!C142&CHAR(10))&IF('PLAN d''ACTION'!E143=\"\",\"\",'PLAN d''ACTION'!C143&CHAR(10))&IF('PLAN d''ACTION'!E144=\"\",\"\",'PLAN d''ACTION'!C144&CHAR(10))&IF('PLAN d''ACTION'!E145=\"\",\"\",'PLAN d''ACTION'!C145&CHAR(10))&IF('PLAN d''ACTION'!E146=\"\",\"\",'PLAN d''ACTION'!C146&CHAR(10))&IF('PLAN d''ACTION'!E147=\"\",\"\",'PLAN d''ACTION'!C147&CHAR(10))&IF('PLAN d''ACTION'!E148=\"\",\"\",'PLAN d''ACTION'!C148&CHAR(10))&IF('PLAN d''ACTION'!E149=\"\",\"\",'PLAN d''ACTION'!C149&CHAR(10))&IF('PLAN d''ACTION'!E150=\"\",\"\",'PLAN d''ACTION'!C150&CHAR(10))&IF('PLAN d''ACTION'!F124=\"\",\"\",'PLAN d''ACTION'!C124&CHAR(10))&IF('PLAN d''ACTION'!F125=\"\",\"\",'PLAN d''ACTION'!C125&CHAR(10))&IF('PLAN d''ACTION'!F126=\"\",\"\",'PLAN d''ACTION'!C126&CHAR(10))&IF('PLAN d''ACTION'!F127=\"\",\"\",'PLAN d''ACTION'!C127&CHAR(10))&IF('PLAN d''ACTION'!F128=\"\",\"\",'PLAN d''ACTION'!C128&CHAR(10))&IF('PLAN d''ACTION'!F129=\"\",\"\",'PLAN d''ACTION'!C129&CHAR(10))&IF('PLAN d''ACTION'!F130=\"\",\"\",'PLAN d''ACTION'!C130&CHAR(10))&IF('PLAN d''ACTION'!F131=\"\",\"\",'PLAN d''ACTION'!C131&CHAR(10))&IF('PLAN d''ACTION'!F132=\"\",\"\",'PLAN d''ACTION'!C132&CHAR(10))&IF('PLAN d''ACTION'!F133=\"\",\"\",'PLAN d''ACTION'!C133&CHAR(10))&IF('PLAN d''ACTION'!F134=\"\",\"\",'PLAN d''ACTION'!C134&CHAR(10))&IF('PLAN d''ACTION'!F135=\"\",\"\",'PLAN d''ACTION'!C135&CHAR(10))&IF('PLAN d''ACTION'!F136=\"\",\"\",'PLAN d''ACTION'!C136&CHAR(10))&IF('PLAN d''ACTION'!F137=\"\",\"\",'PLAN d''ACTION'!C137&CHAR(10))&IF('PLAN d''ACTION'!F138=\"\",\"\",'PLAN d''ACTION'!C138&CHAR(10))&IF('PLAN d''ACTION'!F139=\"\",\"\",'PLAN d''ACTION'!C139&CHAR(10))&IF('PLAN d''ACTION'!F140=\"\",\"\",'PLAN d''ACTION'!C140&CHAR(10))&IF('PLAN d''ACTION'!F141=\"\",\"\",'PLAN d''ACTION'!C141&CHAR(10))&IF('PLAN d''ACTION'!F142=\"\",\"\",'PLAN d''ACTION'!C142&CHAR(10))&IF('PLAN d''ACTION'!F143=\"\",\"\",'PLAN d''ACTION'!C143&CHAR(10))&IF('PLAN d''ACTION'!F144=\"\",\"\",'PLAN d''ACTION'!C144&CHAR(10))&IF('PLAN d''ACTION'!F145=\"\",\"\",'PLAN d''ACTION'!C145&CHAR(10))&IF('PLAN d''ACTION'!F146=\"\",\"\",'PLAN d''ACTION'!C146&CHAR(10))&IF('PLAN d''ACTION'!F147=\"\",\"\",'PLAN d''ACTION'!C147&CHAR(10))&IF('PLAN d''ACTION'!F148=\"\",\"\",'PLAN d''ACTION'!C148&CHAR(10))&IF('PLAN d''ACTION'!F149=\"\",\"\",'PLAN d''ACTION'!C149&CHAR(10))&IF('PLAN d''ACTION'!F150=\"\",\"\",'PLAN d''ACTION'!C150)","v":""}]
[]
["Commentaire"]
[]
[]
[]
[]
[]
["II.4","Gestion des déchets"]
[]
[]
["Les points faibles prioritaires sont:"]
[]
[{"$f":"IF(C406<20,\"Défaut de procédure et/ou organisation concernant le circuit des déchets\"&CHAR(10),\"\")&IF(COUNTIF('Eval 2'!E14,\"*élevé*\"),'Eval 2'!B14&CHAR(10),\"\")&IF(COUNTIF('Eval 2'!E15,\"*élevé*\"),'Eval 2'!B15&CHAR(10),\"\")&IF(COUNTIF('Eval 2'!E16,\"*élevé*\"),'Eval 2'!B16&CHAR(10),\"\")&IF(COUNTIF('Eval 2'!E17,\"*élevé*\"),'Eval 2'!B17&CHAR(10),\"\")&IF(COUNTIF('Eval 2'!E18,\"*élevé*\"),'Eval 2'!B18,\"\")","v":"Défaut de procédure et/ou organisation concernant le circuit des déchets\n"}]
[]
["Les points à améliorer sont:"]
[]
[{"$f":"IF(AND(C406>=20,C406<80),\"Procédure et/ou organisation concernant le circuit des déchets à optimiser\"&CHAR(10),\"\")&IF(COUNTIF('Eval 2'!E14,\"*moyen*\"),'Eval 2'!B14&CHAR(10),\"\")&IF(COUNTIF('Eval 2'!E15,\"*moyen*\"),'Eval 2'!B15&CHAR(10),\"\")&IF(COUNTIF('Eval 2'!E16,\"*moyen*\"),'Eval 2'!B16&CHAR(10),\"\")&IF(COUNTIF('Eval 2'!E17,\"*moyen*\"),'Eval 2'!B17&CHAR(10),\"\")&IF(COUNTIF('Eval 2'!E18,\"*moyen*\"),'Eval 2'!B18,\"\")","v":""}]
[]
["L'évaluation des moyens de maitrise selon l'autoévaluation du GREPHH:"]
[]
[null,null,"% objectifs atteints"]
[null,"Déchets",{"$f":"Rapport!G71","v":0}]
[]
["Indicateurs de suivi:\nAutoévaluation du GREPHH"]
[]
["Autre indicateur de suivi:"]
[]
[]
[]
[]
[]
["Le plan d'action prévoit de façon prioritaire:"]
[]
[{"$f":"IF('PLAN d''ACTION'!D151=\"\",\"\",'PLAN d''ACTION'!C151&CHAR(10))&IF('PLAN d''ACTION'!D152=\"\",\"\",'PLAN d''ACTION'!C152&CHAR(10))&IF('PLAN d''ACTION'!D153=\"\",\"\",'PLAN d''ACTION'!C153&CHAR(10))&IF('PLAN d''ACTION'!D154=\"\",\"\",'PLAN d''ACTION'!C154&CHAR(10))&IF('PLAN d''ACTION'!D155=\"\",\"\",'PLAN d''ACTION'!C155&CHAR(10))&IF('PLAN d''ACTION'!D156=\"\",\"\",'PLAN d''ACTION'!C156&CHAR(10))&IF('PLAN d''ACTION'!D157=\"\",\"\",'PLAN d''ACTION'!C157&CHAR(10))&IF('PLAN d''ACTION'!D158=\"\",\"\",'PLAN d''ACTION'!C158&CHAR(10))&IF('PLAN d''ACTION'!D159=\"\",\"\",'PLAN d''ACTION'!C159&CHAR(10))&IF('PLAN d''ACTION'!D160=\"\",\"\",'PLAN d''ACTION'!C160&CHAR(10))&IF('PLAN d''ACTION'!D161=\"\",\"\",'PLAN d''ACTION'!C161&CHAR(10))&IF('PLAN d''ACTION'!D162=\"\",\"\",'PLAN d''ACTION'!C162&CHAR(10))&IF('PLAN d''ACTION'!D163=\"\",\"\",'PLAN d''ACTION'!C163&CHAR(10))&IF('PLAN d''ACTION'!D164=\"\",\"\",'PLAN d''ACTION'!C164&CHAR(10))&IF('PLAN d''ACTION'!D165=\"\",\"\",'PLAN d''ACTION'!C165&CHAR(10))&IF('PLAN d''ACTION'!D166=\"\",\"\",'PLAN d''ACTION'!C166&CHAR(10))&IF('PLAN d''ACTION'!D167=\"\",\"\",'PLAN d''ACTION'!C167&CHAR(10))&IF('PLAN d''ACTION'!D168=\"\",\"\",'PLAN d''ACTION'!C168&CHAR(10))&IF('PLAN d''ACTION'!D169=\"\",\"\",'PLAN d''ACTION'!C169&CHAR(10))&IF('PLAN d''ACTION'!D170=\"\",\"\",'PLAN d''ACTION'!C170&CHAR(10))&IF('PLAN d''ACTION'!D171=\"\",\"\",'PLAN d''ACTION'!C171&CHAR(10))&IF('PLAN d''ACTION'!D172=\"\",\"\",'PLAN d''ACTION'!C172)","v":""}]
[]
["Le plan d'action prévoit également:"]
[]
[{"$f":"IF('PLAN d''ACTION'!E151=\"\",\"\",'PLAN d''ACTION'!C151&CHAR(10))&IF('PLAN d''ACTION'!E152=\"\",\"\",'PLAN d''ACTION'!C152&CHAR(10))&IF('PLAN d''ACTION'!E153=\"\",\"\",'PLAN d''ACTION'!C153&CHAR(10))&IF('PLAN d''ACTION'!E154=\"\",\"\",'PLAN d''ACTION'!C154&CHAR(10))&IF('PLAN d''ACTION'!E155=\"\",\"\",'PLAN d''ACTION'!C155&CHAR(10))&IF('PLAN d''ACTION'!E156=\"\",\"\",'PLAN d''ACTION'!C156&CHAR(10))&IF('PLAN d''ACTION'!E157=\"\",\"\",'PLAN d''ACTION'!C157&CHAR(10))&IF('PLAN d''ACTION'!E158=\"\",\"\",'PLAN d''ACTION'!C158&CHAR(10))&IF('PLAN d''ACTION'!E159=\"\",\"\",'PLAN d''ACTION'!C159&CHAR(10))&IF('PLAN d''ACTION'!E160=\"\",\"\",'PLAN d''ACTION'!C160&CHAR(10))&IF('PLAN d''ACTION'!E161=\"\",\"\",'PLAN d''ACTION'!C161&CHAR(10))&IF('PLAN d''ACTION'!E162=\"\",\"\",'PLAN d''ACTION'!C162&CHAR(10))&IF('PLAN d''ACTION'!E163=\"\",\"\",'PLAN d''ACTION'!C163&CHAR(10))&IF('PLAN d''ACTION'!E164=\"\",\"\",'PLAN d''ACTION'!C164&CHAR(10))&IF('PLAN d''ACTION'!E165=\"\",\"\",'PLAN d''ACTION'!C165)&IF('PLAN d''ACTION'!E166=\"\",\"\",'PLAN d''ACTION'!C166&CHAR(10))&IF('PLAN d''ACTION'!E167=\"\",\"\",'PLAN d''ACTION'!C167&CHAR(10))&IF('PLAN d''ACTION'!E168=\"\",\"\",'PLAN d''ACTION'!C168&CHAR(10))&IF('PLAN d''ACTION'!E169=\"\",\"\",'PLAN d''ACTION'!C169&CHAR(10))&IF('PLAN d''ACTION'!E170=\"\",\"\",'PLAN d''ACTION'!C170&CHAR(10))&IF('PLAN d''ACTION'!E171=\"\",\"\",'PLAN d''ACTION'!C171&CHAR(10))&IF('PLAN d''ACTION'!E172=\"\",\"\",'PLAN d''ACTION'!C172&CHAR(10))&IF('PLAN d''ACTION'!F151=\"\",\"\",'PLAN d''ACTION'!C151&CHAR(10))&IF('PLAN d''ACTION'!F152=\"\",\"\",'PLAN d''ACTION'!C152&CHAR(10))&IF('PLAN d''ACTION'!F153=\"\",\"\",'PLAN d''ACTION'!C153&CHAR(10))&IF('PLAN d''ACTION'!F154=\"\",\"\",'PLAN d''ACTION'!C154&CHAR(10))&IF('PLAN d''ACTION'!F155=\"\",\"\",'PLAN d''ACTION'!C155&CHAR(10))&IF('PLAN d''ACTION'!F156=\"\",\"\",'PLAN d''ACTION'!C156&CHAR(10))&IF('PLAN d''ACTION'!F157=\"\",\"\",'PLAN d''ACTION'!C157&CHAR(10))&IF('PLAN d''ACTION'!F158=\"\",\"\",'PLAN d''ACTION'!C158&CHAR(10))&IF('PLAN d''ACTION'!F159=\"\",\"\",'PLAN d''ACTION'!C159&CHAR(10))&IF('PLAN d''ACTION'!F160=\"\",\"\",'PLAN d''ACTION'!C160&CHAR(10))&IF('PLAN d''ACTION'!F161=\"\",\"\",'PLAN d''ACTION'!C161&CHAR(10))&IF('PLAN d''ACTION'!F162=\"\",\"\",'PLAN d''ACTION'!C162&CHAR(10))&IF('PLAN d''ACTION'!F163=\"\",\"\",'PLAN d''ACTION'!C163&CHAR(10))&IF('PLAN d''ACTION'!F164=\"\",\"\",'PLAN d''ACTION'!C164&CHAR(10))&IF('PLAN d''ACTION'!F165=\"\",\"\",'PLAN d''ACTION'!C165)&IF('PLAN d''ACTION'!F166=\"\",\"\",'PLAN d''ACTION'!C166&CHAR(10))&IF('PLAN d''ACTION'!F167=\"\",\"\",'PLAN d''ACTION'!C167&CHAR(10))&IF('PLAN d''ACTION'!F168=\"\",\"\",'PLAN d''ACTION'!C168&CHAR(10))&IF('PLAN d''ACTION'!F169=\"\",\"\",'PLAN d''ACTION'!C169&CHAR(10))&IF('PLAN d''ACTION'!F170=\"\",\"\",'PLAN d''ACTION'!C170&CHAR(10))&IF('PLAN d''ACTION'!F171=\"\",\"\",'PLAN d''ACTION'!C171&CHAR(10))&IF('PLAN d''ACTION'!F172=\"\",\"\",'PLAN d''ACTION'!C172)","v":""}]
[]
[]
["Commentaire"]
[]
[]
[]
[]
[]
["II.4","Gestion de la qualité de l'eau"]
[]
[]
["Les points faibles prioritaires sont:"]
[]
[{"$f":"IF(C445<20,\"Défaut de procédure et/ou organisation concernant la gestion de la qualité de l'eau\"&CHAR(10),\"\")&IF(COUNTIF('Eval 2'!E25,\"*élevé*\"),'Eval 2'!B25&CHAR(10),\"\")&IF(COUNTIF('Eval 2'!E26,\"*élevé*\"),'Eval 2'!B26&CHAR(10),\"\")&IF(COUNTIF('Eval 2'!E27,\"*élevé*\"),'Eval 2'!B27&CHAR(10),\"\")&IF(COUNTIF('Eval 2'!E28,\"*élevé*\"),'Eval 2'!B28&CHAR(10),\"\")&IF(COUNTIF('Eval 2'!E29,\"*élevé*\"),'Eval 2'!B29&CHAR(10),\"\")&IF(COUNTIF('Eval 2'!E30,\"*élevé*\"),'Eval 2'!B30&CHAR(10),\"\")&IF(COUNTIF('Eval 2'!E31,\"*élevé*\"),'Eval 2'!B31&CHAR(10),\"\")&IF(COUNTIF('Eval 2'!E32,\"*élevé*\"),'Eval 2'!B32&CHAR(10),\"\")&IF(COUNTIF('Eval 2'!E33,\"*élevé*\"),'Eval 2'!B33&CHAR(10),\"\")&IF(COUNTIF('Eval 2'!E34,\"*élevé*\"),'Eval 2'!B34&CHAR(10),\"\")&IF(COUNTIF('Eval 2'!E35,\"*élevé*\"),'Eval 2'!B35,\"\")","v":"Défaut de procédure et/ou organisation concernant la gestion de la qualité de l'eau\n"}]
[]
["Les points à améliorer sont:"]
[]
[{"$f":"IF(AND(C445>=20,C445<80),\"Procédures et/ou organisation concernant la gestion de la qualité de l'eau à optimiser\"&CHAR(10),\"\")&IF(COUNTIF('Eval 2'!E25,\"*moyen*\"),'Eval 2'!B25&CHAR(10),\"\")&IF(COUNTIF('Eval 2'!E26,\"*moyen*\"),'Eval 2'!B26&CHAR(10),\"\")&IF(COUNTIF('Eval 2'!E27,\"*moyen*\"),'Eval 2'!B27&CHAR(10),\"\")&IF(COUNTIF('Eval 2'!E28,\"*moyen*\"),'Eval 2'!B28&CHAR(10),\"\")&IF(COUNTIF('Eval 2'!E29,\"*moyen*\"),'Eval 2'!B29&CHAR(10),\"\")&IF(COUNTIF('Eval 2'!E30,\"*moyen*\"),'Eval 2'!B30&CHAR(10),\"\")&IF(COUNTIF('Eval 2'!E31,\"*moyen*\"),'Eval 2'!B31&CHAR(10),\"\")&IF(COUNTIF('Eval 2'!E32,\"*moyen*\"),'Eval 2'!B32&CHAR(10),\"\")&IF(COUNTIF('Eval 2'!E33,\"*moyen*\"),'Eval 2'!B33&CHAR(10),\"\")&IF(COUNTIF('Eval 2'!E34,\"*moyen*\"),'Eval 2'!B34&CHAR(10),\"\")&IF(COUNTIF('Eval 2'!E35,\"*moyen*\"),'Eval 2'!B35,\"\")","v":"Défaut de suivi du carnet sanitaire\n"}]
[]
["L'évaluation des moyens de maitrise:"]
[]
[null,null,"% objectifs atteints"]
[null,"Gestion de la qualité de l'eau",{"$f":"Rapport!G72","v":0}]
[]
["Indicateurs de suivi:\nAutoévaluation du GREPHH"]
[]
["Autre indicateur de suivi:"]
[]
[]
[]
[]
[]
["Le plan d'action prévoit de façon prioritaire:"]
[]
[{"$f":"IF('PLAN d''ACTION'!D173=\"\",\"\",'PLAN d''ACTION'!C173&CHAR(10))&IF('PLAN d''ACTION'!D174=\"\",\"\",'PLAN d''ACTION'!C174&CHAR(10))&IF('PLAN d''ACTION'!D175=\"\",\"\",'PLAN d''ACTION'!C175&CHAR(10))&IF('PLAN d''ACTION'!D176=\"\",\"\",'PLAN d''ACTION'!C176&CHAR(10))&IF('PLAN d''ACTION'!D177=\"\",\"\",'PLAN d''ACTION'!C177&CHAR(10))&IF('PLAN d''ACTION'!D178=\"\",\"\",'PLAN d''ACTION'!C178&CHAR(10))&IF('PLAN d''ACTION'!D179=\"\",\"\",'PLAN d''ACTION'!C179&CHAR(10))&IF('PLAN d''ACTION'!D180=\"\",\"\",'PLAN d''ACTION'!C180&CHAR(10))&IF('PLAN d''ACTION'!D181=\"\",\"\",'PLAN d''ACTION'!C181&CHAR(10))&IF('PLAN d''ACTION'!D182=\"\",\"\",'PLAN d''ACTION'!C182&CHAR(10))&IF('PLAN d''ACTION'!D183=\"\",\"\",'PLAN d''ACTION'!C183&CHAR(10))&IF('PLAN d''ACTION'!D184=\"\",\"\",'PLAN d''ACTION'!C184&CHAR(10))&IF('PLAN d''ACTION'!D185=\"\",\"\",'PLAN d''ACTION'!C185&CHAR(10))&IF('PLAN d''ACTION'!D186=\"\",\"\",'PLAN d''ACTION'!C186&CHAR(10))&IF('PLAN d''ACTION'!D187=\"\",\"\",'PLAN d''ACTION'!C187)&IF('PLAN d''ACTION'!D188=\"\",\"\",'PLAN d''ACTION'!C188&CHAR(10))&IF('PLAN d''ACTION'!D189=\"\",\"\",'PLAN d''ACTION'!C189&CHAR(10))&IF('PLAN d''ACTION'!D190=\"\",\"\",'PLAN d''ACTION'!C190&CHAR(10))&IF('PLAN d''ACTION'!D191=\"\",\"\",'PLAN d''ACTION'!C191&CHAR(10))&IF('PLAN d''ACTION'!D192=\"\",\"\",'PLAN d''ACTION'!C192&CHAR(10))&IF('PLAN d''ACTION'!D193=\"\",\"\",'PLAN d''ACTION'!C193&CHAR(10))&IF('PLAN d''ACTION'!D194=\"\",\"\",'PLAN d''ACTION'!C194&CHAR(10))&IF('PLAN d''ACTION'!D195=\"\",\"\",'PLAN d''ACTION'!C195&CHAR(10))&IF('PLAN d''ACTION'!D196=\"\",\"\",'PLAN d''ACTION'!C196&CHAR(10))&IF('PLAN d''ACTION'!D197=\"\",\"\",'PLAN d''ACTION'!C197&CHAR(10))&IF('PLAN d''ACTION'!D198=\"\",\"\",'PLAN d''ACTION'!C198&CHAR(10))&IF('PLAN d''ACTION'!D199=\"\",\"\",'PLAN d''ACTION'!C199&CHAR(10))&IF('PLAN d''ACTION'!D200=\"\",\"\",'PLAN d''ACTION'!C200&CHAR(10))&IF('PLAN d''ACTION'!D201=\"\",\"\",'PLAN d''ACTION'!C201&CHAR(10))&IF('PLAN d''ACTION'!D202=\"\",\"\",'PLAN d''ACTION'!C202&CHAR(10))&IF('PLAN d''ACTION'!D203=\"\",\"\",'PLAN d''ACTION'!C203&CHAR(10))&IF('PLAN d''ACTION'!D204=\"\",\"\",'PLAN d''ACTION'!C204&CHAR(10))&IF('PLAN d''ACTION'!D205=\"\",\"\",'PLAN d''ACTION'!C205&CHAR(10))&IF('PLAN d''ACTION'!D206=\"\",\"\",'PLAN d''ACTION'!C206&CHAR(10))&IF('PLAN d''ACTION'!D207=\"\",\"\",'PLAN d''ACTION'!C207&CHAR(10))&IF('PLAN d''ACTION'!D208=\"\",\"\",'PLAN d''ACTION'!C208&CHAR(10))&IF('PLAN d''ACTION'!D209=\"\",\"\",'PLAN d''ACTION'!C209&CHAR(10))&IF('PLAN d''ACTION'!D210=\"\",\"\",'PLAN d''ACTION'!C210&CHAR(10))&IF('PLAN d''ACTION'!D211=\"\",\"\",'PLAN d''ACTION'!C211&CHAR(10))&IF('PLAN d''ACTION'!D212=\"\",\"\",'PLAN d''ACTION'!C212&CHAR(10))&IF('PLAN d''ACTION'!D213=\"\",\"\",'PLAN d''ACTION'!C213&CHAR(10))&IF('PLAN d''ACTION'!D214=\"\",\"\",'PLAN d''ACTION'!C214&CHAR(10))&IF('PLAN d''ACTION'!D215=\"\",\"\",'PLAN d''ACTION'!C215&CHAR(10))&IF('PLAN d''ACTION'!D216=\"\",\"\",'PLAN d''ACTION'!C216)","v":""}]
[]
["Le plan d'action prévoit également:"]
[]
[{"$f":"IF('PLAN d''ACTION'!E173=\"\",\"\",'PLAN d''ACTION'!C173&CHAR(10))&IF('PLAN d''ACTION'!E174=\"\",\"\",'PLAN d''ACTION'!C174&CHAR(10))&IF('PLAN d''ACTION'!E175=\"\",\"\",'PLAN d''ACTION'!C175&CHAR(10))&IF('PLAN d''ACTION'!E176=\"\",\"\",'PLAN d''ACTION'!C176&CHAR(10))&IF('PLAN d''ACTION'!E177=\"\",\"\",'PLAN d''ACTION'!C177&CHAR(10))&IF('PLAN d''ACTION'!E178=\"\",\"\",'PLAN d''ACTION'!C178&CHAR(10))&IF('PLAN d''ACTION'!E179=\"\",\"\",'PLAN d''ACTION'!C179&CHAR(10))&IF('PLAN d''ACTION'!E180=\"\",\"\",'PLAN d''ACTION'!C180&CHAR(10))&IF('PLAN d''ACTION'!E181=\"\",\"\",'PLAN d''ACTION'!C181&CHAR(10))&IF('PLAN d''ACTION'!E182=\"\",\"\",'PLAN d''ACTION'!C182&CHAR(10))&IF('PLAN d''ACTION'!E183=\"\",\"\",'PLAN d''ACTION'!C183&CHAR(10))&IF('PLAN d''ACTION'!E184=\"\",\"\",'PLAN d''ACTION'!C184&CHAR(10))&IF('PLAN d''ACTION'!E185=\"\",\"\",'PLAN d''ACTION'!C185&CHAR(10))&IF('PLAN d''ACTION'!E186=\"\",\"\",'PLAN d''ACTION'!C186&CHAR(10))&IF('PLAN d''ACTION'!E187=\"\",\"\",'PLAN d''ACTION'!C187&CHAR(10))&IF('PLAN d''ACTION'!E188=\"\",\"\",'PLAN d''ACTION'!C188&CHAR(10))&IF('PLAN d''ACTION'!E189=\"\",\"\",'PLAN d''ACTION'!C189&CHAR(10))&IF('PLAN d''ACTION'!E190=\"\",\"\",'PLAN d''ACTION'!C190&CHAR(10))&IF('PLAN d''ACTION'!E191=\"\",\"\",'PLAN d''ACTION'!C191&CHAR(10))&IF('PLAN d''ACTION'!E192=\"\",\"\",'PLAN d''ACTION'!C192&CHAR(10))&IF('PLAN d''ACTION'!E193=\"\",\"\",'PLAN d''ACTION'!C193&CHAR(10))&IF('PLAN d''ACTION'!E194=\"\",\"\",'PLAN d''ACTION'!C194&CHAR(10))&IF('PLAN d''ACTION'!E195=\"\",\"\",'PLAN d''ACTION'!C195&CHAR(10))&IF('PLAN d''ACTION'!E196=\"\",\"\",'PLAN d''ACTION'!C196&CHAR(10))&IF('PLAN d''ACTION'!E197=\"\",\"\",'PLAN d''ACTION'!C197&CHAR(10))&IF('PLAN d''ACTION'!E198=\"\",\"\",'PLAN d''ACTION'!C198&CHAR(10))&IF('PLAN d''ACTION'!E199=\"\",\"\",'PLAN d''ACTION'!C199&CHAR(10))&IF('PLAN d''ACTION'!E200=\"\",\"\",'PLAN d''ACTION'!C200&CHAR(10))&IF('PLAN d''ACTION'!E201=\"\",\"\",'PLAN d''ACTION'!C201&CHAR(10))&IF('PLAN d''ACTION'!E202=\"\",\"\",'PLAN d''ACTION'!C202&CHAR(10))&IF('PLAN d''ACTION'!E203=\"\",\"\",'PLAN d''ACTION'!C203&CHAR(10))&IF('PLAN d''ACTION'!E204=\"\",\"\",'PLAN d''ACTION'!C204&CHAR(10))&IF('PLAN d''ACTION'!E205=\"\",\"\",'PLAN d''ACTION'!C205&CHAR(10))&IF('PLAN d''ACTION'!E206=\"\",\"\",'PLAN d''ACTION'!C206&CHAR(10))&IF('PLAN d''ACTION'!E207=\"\",\"\",'PLAN d''ACTION'!C207&CHAR(10))&IF('PLAN d''ACTION'!E208=\"\",\"\",'PLAN d''ACTION'!C208&CHAR(10))&IF('PLAN d''ACTION'!E209=\"\",\"\",'PLAN d''ACTION'!C209&CHAR(10))&IF('PLAN d''ACTION'!E210=\"\",\"\",'PLAN d''ACTION'!C210&CHAR(10))&IF('PLAN d''ACTION'!E211=\"\",\"\",'PLAN d''ACTION'!C211&CHAR(10))&IF('PLAN d''ACTION'!E212=\"\",\"\",'PLAN d''ACTION'!C212&CHAR(10))&IF('PLAN d''ACTION'!E213=\"\",\"\",'PLAN d''ACTION'!C213&CHAR(10))&IF('PLAN d''ACTION'!E214=\"\",\"\",'PLAN d''ACTION'!C214&CHAR(10))&IF('PLAN d''ACTION'!E215=\"\",\"\",'PLAN d''ACTION'!C215&CHAR(10))&IF('PLAN d''ACTION'!E216=\"\",\"\",'PLAN d''ACTION'!C216&CHAR(10))&IF('PLAN d''ACTION'!F173=\"\",\"\",'PLAN d''ACTION'!C173&CHAR(10))&IF('PLAN d''ACTION'!F174=\"\",\"\",'PLAN d''ACTION'!C174&CHAR(10))&IF('PLAN d''ACTION'!F175=\"\",\"\",'PLAN d''ACTION'!C175&CHAR(10))&IF('PLAN d''ACTION'!F176=\"\",\"\",'PLAN d''ACTION'!C176&CHAR(10))&IF('PLAN d''ACTION'!F177=\"\",\"\",'PLAN d''ACTION'!C177&CHAR(10))&IF('PLAN d''ACTION'!F178=\"\",\"\",'PLAN d''ACTION'!C178&CHAR(10))&IF('PLAN d''ACTION'!F179=\"\",\"\",'PLAN d''ACTION'!C179&CHAR(10))&IF('PLAN d''ACTION'!F180=\"\",\"\",'PLAN d''ACTION'!C180&CHAR(10))&IF('PLAN d''ACTION'!F181=\"\",\"\",'PLAN d''ACTION'!C181&CHAR(10))&IF('PLAN d''ACTION'!F182=\"\",\"\",'PLAN d''ACTION'!C182&CHAR(10))&IF('PLAN d''ACTION'!F183=\"\",\"\",'PLAN d''ACTION'!C183&CHAR(10))&IF('PLAN d''ACTION'!F184=\"\",\"\",'PLAN d''ACTION'!C184&CHAR(10))&IF('PLAN d''ACTION'!F185=\"\",\"\",'PLAN d''ACTION'!C185&CHAR(10))&IF('PLAN d''ACTION'!F186=\"\",\"\",'PLAN d''ACTION'!C186&CHAR(10))&IF('PLAN d''ACTION'!F187=\"\",\"\",'PLAN d''ACTION'!C187&CHAR(10))&IF('PLAN d''ACTION'!F188=\"\",\"\",'PLAN d''ACTION'!C188&CHAR(10))&IF('PLAN d''ACTION'!F189=\"\",\"\",'PLAN d''ACTION'!C189&CHAR(10))&IF('PLAN d''ACTION'!F190=\"\",\"\",'PLAN d''ACTION'!C190&CHAR(10))&IF('PLAN d''ACTION'!F191=\"\",\"\",'PLAN d''ACTION'!C191&CHAR(10))&IF('PLAN d''ACTION'!F192=\"\",\"\",'PLAN d''ACTION'!C192&CHAR(10))&IF('PLAN d''ACTION'!F193=\"\",\"\",'PLAN d''ACTION'!C193&CHAR(10))&IF('PLAN d''ACTION'!F194=\"\",\"\",'PLAN d''ACTION'!C194&CHAR(10))&IF('PLAN d''ACTION'!F195=\"\",\"\",'PLAN d''ACTION'!C195&CHAR(10))&IF('PLAN d''ACTION'!F196=\"\",\"\",'PLAN d''ACTION'!C196&CHAR(10))&IF('PLAN d''ACTION'!F197=\"\",\"\",'PLAN d''ACTION'!C197&CHAR(10))&IF('PLAN d''ACTION'!F198=\"\",\"\",'PLAN d''ACTION'!C198&CHAR(10))&IF('PLAN d''ACTION'!F199=\"\",\"\",'PLAN d''ACTION'!C199&CHAR(10))&IF('PLAN d''ACTION'!F200=\"\",\"\",'PLAN d''ACTION'!C200&CHAR(10))&IF('PLAN d''ACTION'!F201=\"\",\"\",'PLAN d''ACTION'!C201&CHAR(10))&IF('PLAN d''ACTION'!F202=\"\",\"\",'PLAN d''ACTION'!C202&CHAR(10))&IF('PLAN d''ACTION'!F203=\"\",\"\",'PLAN d''ACTION'!C203&CHAR(10))&IF('PLAN d''ACTION'!F204=\"\",\"\",'PLAN d''ACTION'!C204&CHAR(10))&IF('PLAN d''ACTION'!F205=\"\",\"\",'PLAN d''ACTION'!C205&CHAR(10))&IF('PLAN d''ACTION'!F206=\"\",\"\",'PLAN d''ACTION'!C206&CHAR(10))&IF('PLAN d''ACTION'!F207=\"\",\"\",'PLAN d''ACTION'!C207&CHAR(10))&IF('PLAN d''ACTION'!F208=\"\",\"\",'PLAN d''ACTION'!C208&CHAR(10))&IF('PLAN d''ACTION'!F209=\"\",\"\",'PLAN d''ACTION'!C209&CHAR(10))&IF('PLAN d''ACTION'!F210=\"\",\"\",'PLAN d''ACTION'!C210&CHAR(10))&IF('PLAN d''ACTION'!F211=\"\",\"\",'PLAN d''ACTION'!C211&CHAR(10))&IF('PLAN d''ACTION'!F212=\"\",\"\",'PLAN d''ACTION'!C212&CHAR(10))&IF('PLAN d''ACTION'!F213=\"\",\"\",'PLAN d''ACTION'!C213&CHAR(10))&IF('PLAN d''ACTION'!F214=\"\",\"\",'PLAN d''ACTION'!C214&CHAR(10))&IF('PLAN d''ACTION'!F215=\"\",\"\",'PLAN d''ACTION'!C215&CHAR(10))&IF('PLAN d''ACTION'!F216=\"\",\"\",'PLAN d''ACTION'!C216)","v":""}]
[]
[]
["Commentaire"]
[]
[]
[]
[]
[]
[]
["III","Gestion du matériel de soins"]
[]
[]
["Les points faibles prioritaires sont:"]
[]
[{"$f":"IF(C485<20,\"Défaut de procédured'entretien du matériel de soins\"&CHAR(10),\"\")&IF(COUNTIF('Eval 3'!E4,\"*élevé*\"),'Eval 3'!B4&CHAR(10),\"\")&IF(COUNTIF('Eval 3'!E5,\"*élevé*\"),'Eval 3'!B5&CHAR(10),\"\")&IF(COUNTIF('Eval 3'!E6,\"*élevé*\"),'Eval 3'!B6&CHAR(10),\"\")&IF(COUNTIF('Eval 3'!E7,\"*élevé*\"),'Eval 3'!B7&CHAR(10),\"\")&IF(COUNTIF('Eval 3'!E8,\"*élevé*\"),'Eval 3'!B8,\"\")","v":"Défaut de procédured'entretien du matériel de soins\n"}]
[]
["Les points à améliorer sont:"]
[]
[{"$f":"IF(AND(C485>=20,C485<80),\"Procédures d'entretien du matériel de soins à optimiser\"&CHAR(10),\"\")&IF(COUNTIF('Eval 3'!E4,\"*moyen*\"),'Eval 3'!B4&CHAR(10),\"\")&IF(COUNTIF('Eval 3'!E5,\"*moyen*\"),'Eval 3'!B5&CHAR(10),\"\")&IF(COUNTIF('Eval 3'!E6,\"*moyen*\"),'Eval 3'!B6&CHAR(10),\"\")&IF(COUNTIF('Eval 3'!E7,\"*moyen*\"),'Eval 3'!B7&CHAR(10),\"\")&IF(COUNTIF('Eval 3'!E8,\"*moyen*\"),'Eval 3'!B8,\"\")","v":""}]
[]
["L'évaluation des moyens de maitrise selon l'autoévaluation du GREPHH:"]
[]
[null,null,"% objectifs atteints"]
[null,"Gestion du matériel de soins",{"$f":"Rapport!G91","v":0}]
[]
["Indicateurs de suivi:\nAutoévaluation du GREPHH"]
[]
[]
[]
[]
[]
[]
[]
[]
[]
[]
[]
[]
[]
["Le plan d'action prévoit de façon prioritaire:"]
[]
[{"$f":"IF('PLAN d''ACTION'!D219=\"\",\"\",'PLAN d''ACTION'!C219&CHAR(10))&IF('PLAN d''ACTION'!D220=\"\",\"\",'PLAN d''ACTION'!C220&CHAR(10))&IF('PLAN d''ACTION'!D221=\"\",\"\",'PLAN d''ACTION'!C221&CHAR(10))&IF('PLAN d''ACTION'!D222=\"\",\"\",'PLAN d''ACTION'!C222&CHAR(10))&IF('PLAN d''ACTION'!D223=\"\",\"\",'PLAN d''ACTION'!C223)&IF('PLAN d''ACTION'!D224=\"\",\"\",'PLAN d''ACTION'!C224&CHAR(10))&IF('PLAN d''ACTION'!D225=\"\",\"\",'PLAN d''ACTION'!C225&CHAR(10))&IF('PLAN d''ACTION'!D226=\"\",\"\",'PLAN d''ACTION'!C226&CHAR(10))&IF('PLAN d''ACTION'!D227=\"\",\"\",'PLAN d''ACTION'!C227&CHAR(10))&IF('PLAN d''ACTION'!D228=\"\",\"\",'PLAN d''ACTION'!C228&CHAR(10))&IF('PLAN d''ACTION'!D229=\"\",\"\",'PLAN d''ACTION'!C229&CHAR(10))&IF('PLAN d''ACTION'!D230=\"\",\"\",'PLAN d''ACTION'!C230&CHAR(10))&IF('PLAN d''ACTION'!D231=\"\",\"\",'PLAN d''ACTION'!C231&CHAR(10))&IF('PLAN d''ACTION'!D232=\"\",\"\",'PLAN d''ACTION'!C232&CHAR(10))&IF('PLAN d''ACTION'!D233=\"\",\"\",'PLAN d''ACTION'!C233&CHAR(10))&IF('PLAN d''ACTION'!D234=\"\",\"\",'PLAN d''ACTION'!C234&CHAR(10))&IF('PLAN d''ACTION'!D235=\"\",\"\",'PLAN d''ACTION'!C235&CHAR(10))&IF('PLAN d''ACTION'!D236=\"\",\"\",'PLAN d''ACTION'!C236&CHAR(10))&IF('PLAN d''ACTION'!D237=\"\",\"\",'PLAN d''ACTION'!C237&CHAR(10))&IF('PLAN d''ACTION'!D238=\"\",\"\",'PLAN d''ACTION'!C238&CHAR(10))&IF('PLAN d''ACTION'!D239=\"\",\"\",'PLAN d''ACTION'!C239&CHAR(10))&IF('PLAN d''ACTION'!D240=\"\",\"\",'PLAN d''ACTION'!C240&CHAR(10))&IF('PLAN d''ACTION'!D241=\"\",\"\",'PLAN d''ACTION'!C241&CHAR(10))&IF('PLAN d''ACTION'!D242=\"\",\"\",'PLAN d''ACTION'!C242&CHAR(10))&IF('PLAN d''ACTION'!D243=\"\",\"\",'PLAN d''ACTION'!C243&CHAR(10))&IF('PLAN d''ACTION'!D244=\"\",\"\",'PLAN d''ACTION'!C244&CHAR(10))&IF('PLAN d''ACTION'!D245=\"\",\"\",'PLAN d''ACTION'!C245&CHAR(10))&IF('PLAN d''ACTION'!D246=\"\",\"\",'PLAN d''ACTION'!C246&CHAR(10))&IF('PLAN d''ACTION'!D247=\"\",\"\",'PLAN d''ACTION'!C247&CHAR(10))&IF('PLAN d''ACTION'!D248=\"\",\"\",'PLAN d''ACTION'!C248&CHAR(10))&IF('PLAN d''ACTION'!D249=\"\",\"\",'PLAN d''ACTION'!C249&CHAR(10))&IF('PLAN d''ACTION'!D250=\"\",\"\",'PLAN d''ACTION'!C250&CHAR(10))&IF('PLAN d''ACTION'!D251=\"\",\"\",'PLAN d''ACTION'!C251&CHAR(10))&IF('PLAN d''ACTION'!D252=\"\",\"\",'PLAN d''ACTION'!C252&CHAR(10))&IF('PLAN d''ACTION'!D253=\"\",\"\",'PLAN d''ACTION'!C253&CHAR(10))&IF('PLAN d''ACTION'!D254=\"\",\"\",'PLAN d''ACTION'!C254&CHAR(10))&IF('PLAN d''ACTION'!D255=\"\",\"\",'PLAN d''ACTION'!C255&CHAR(10))&IF('PLAN d''ACTION'!D256=\"\",\"\",'PLAN d''ACTION'!C256&CHAR(10))&IF('PLAN d''ACTION'!D257=\"\",\"\",'PLAN d''ACTION'!C257&CHAR(10))&IF('PLAN d''ACTION'!D258=\"\",\"\",'PLAN d''ACTION'!C258&CHAR(10))&IF('PLAN d''ACTION'!D259=\"\",\"\",'PLAN d''ACTION'!C259&CHAR(10))&IF('PLAN d''ACTION'!D260=\"\",\"\",'PLAN d''ACTION'!C260&CHAR(10))&IF('PLAN d''ACTION'!D261=\"\",\"\",'PLAN d''ACTION'!C261)","v":""}]
[]
[]
["Le plan d'action prévoit également:"]
[]
[{"$f":"IF('PLAN d''ACTION'!E219=\"\",\"\",'PLAN d''ACTION'!C219&CHAR(10))&IF('PLAN d''ACTION'!E220=\"\",\"\",'PLAN d''ACTION'!C220&CHAR(10))&IF('PLAN d''ACTION'!E221=\"\",\"\",'PLAN d''ACTION'!C221&CHAR(10))&IF('PLAN d''ACTION'!E222=\"\",\"\",'PLAN d''ACTION'!C222&CHAR(10))&IF('PLAN d''ACTION'!E223=\"\",\"\",'PLAN d''ACTION'!C223)&IF('PLAN d''ACTION'!E224=\"\",\"\",'PLAN d''ACTION'!C224&CHAR(10))&IF('PLAN d''ACTION'!E225=\"\",\"\",'PLAN d''ACTION'!C225&CHAR(10))&IF('PLAN d''ACTION'!E226=\"\",\"\",'PLAN d''ACTION'!C226&CHAR(10))&IF('PLAN d''ACTION'!E227=\"\",\"\",'PLAN d''ACTION'!C227&CHAR(10))&IF('PLAN d''ACTION'!E228=\"\",\"\",'PLAN d''ACTION'!C228&CHAR(10))&IF('PLAN d''ACTION'!E229=\"\",\"\",'PLAN d''ACTION'!C229&CHAR(10))&IF('PLAN d''ACTION'!E230=\"\",\"\",'PLAN d''ACTION'!C230&CHAR(10))&IF('PLAN d''ACTION'!E231=\"\",\"\",'PLAN d''ACTION'!C231&CHAR(10))&IF('PLAN d''ACTION'!E232=\"\",\"\",'PLAN d''ACTION'!C232&CHAR(10))&IF('PLAN d''ACTION'!E233=\"\",\"\",'PLAN d''ACTION'!C233&CHAR(10))&IF('PLAN d''ACTION'!E234=\"\",\"\",'PLAN d''ACTION'!C234&CHAR(10))&IF('PLAN d''ACTION'!E235=\"\",\"\",'PLAN d''ACTION'!C235&CHAR(10))&IF('PLAN d''ACTION'!E236=\"\",\"\",'PLAN d''ACTION'!C236&CHAR(10))&IF('PLAN d''ACTION'!E237=\"\",\"\",'PLAN d''ACTION'!C237&CHAR(10))&IF('PLAN d''ACTION'!E238=\"\",\"\",'PLAN d''ACTION'!C238&CHAR(10))&IF('PLAN d''ACTION'!E239=\"\",\"\",'PLAN d''ACTION'!C239&CHAR(10))&IF('PLAN d''ACTION'!E240=\"\",\"\",'PLAN d''ACTION'!C240&CHAR(10))&IF('PLAN d''ACTION'!E241=\"\",\"\",'PLAN d''ACTION'!C241&CHAR(10))&IF('PLAN d''ACTION'!E242=\"\",\"\",'PLAN d''ACTION'!C242&CHAR(10))&IF('PLAN d''ACTION'!E243=\"\",\"\",'PLAN d''ACTION'!C243&CHAR(10))&IF('PLAN d''ACTION'!E244=\"\",\"\",'PLAN d''ACTION'!C244&CHAR(10))&IF('PLAN d''ACTION'!E245=\"\",\"\",'PLAN d''ACTION'!C245&CHAR(10))&IF('PLAN d''ACTION'!E246=\"\",\"\",'PLAN d''ACTION'!C246&CHAR(10))&IF('PLAN d''ACTION'!E247=\"\",\"\",'PLAN d''ACTION'!C247&CHAR(10))&IF('PLAN d''ACTION'!E248=\"\",\"\",'PLAN d''ACTION'!C248&CHAR(10))&IF('PLAN d''ACTION'!E249=\"\",\"\",'PLAN d''ACTION'!C249&CHAR(10))&IF('PLAN d''ACTION'!E250=\"\",\"\",'PLAN d''ACTION'!C250&CHAR(10))&IF('PLAN d''ACTION'!E251=\"\",\"\",'PLAN d''ACTION'!C251&CHAR(10))&IF('PLAN d''ACTION'!E252=\"\",\"\",'PLAN d''ACTION'!C252&CHAR(10))&IF('PLAN d''ACTION'!E253=\"\",\"\",'PLAN d''ACTION'!C253&CHAR(10))&IF('PLAN d''ACTION'!E254=\"\",\"\",'PLAN d''ACTION'!C254&CHAR(10))&IF('PLAN d''ACTION'!E255=\"\",\"\",'PLAN d''ACTION'!C255&CHAR(10))&IF('PLAN d''ACTION'!E256=\"\",\"\",'PLAN d''ACTION'!C256&CHAR(10))&IF('PLAN d''ACTION'!E257=\"\",\"\",'PLAN d''ACTION'!C257&CHAR(10))&IF('PLAN d''ACTION'!E258=\"\",\"\",'PLAN d''ACTION'!C258&CHAR(10))&IF('PLAN d''ACTION'!E259=\"\",\"\",'PLAN d''ACTION'!C259&CHAR(10))&IF('PLAN d''ACTION'!E260=\"\",\"\",'PLAN d''ACTION'!C260&CHAR(10))&IF('PLAN d''ACTION'!E261=\"\",\"\",'PLAN d''ACTION'!C261&CHAR(10))&IF('PLAN d''ACTION'!F219=\"\",\"\",'PLAN d''ACTION'!C219&CHAR(10))&IF('PLAN d''ACTION'!F220=\"\",\"\",'PLAN d''ACTION'!C220&CHAR(10))&IF('PLAN d''ACTION'!F221=\"\",\"\",'PLAN d''ACTION'!C221&CHAR(10))&IF('PLAN d''ACTION'!F222=\"\",\"\",'PLAN d''ACTION'!C222&CHAR(10))&IF('PLAN d''ACTION'!F223=\"\",\"\",'PLAN d''ACTION'!C223)&IF('PLAN d''ACTION'!F224=\"\",\"\",'PLAN d''ACTION'!C224&CHAR(10))&IF('PLAN d''ACTION'!F225=\"\",\"\",'PLAN d''ACTION'!C225&CHAR(10))&IF('PLAN d''ACTION'!F226=\"\",\"\",'PLAN d''ACTION'!C226&CHAR(10))&IF('PLAN d''ACTION'!F227=\"\",\"\",'PLAN d''ACTION'!C227&CHAR(10))&IF('PLAN d''ACTION'!F228=\"\",\"\",'PLAN d''ACTION'!C228&CHAR(10))&IF('PLAN d''ACTION'!F229=\"\",\"\",'PLAN d''ACTION'!C229&CHAR(10))&IF('PLAN d''ACTION'!F230=\"\",\"\",'PLAN d''ACTION'!C230&CHAR(10))&IF('PLAN d''ACTION'!F231=\"\",\"\",'PLAN d''ACTION'!C231&CHAR(10))&IF('PLAN d''ACTION'!F232=\"\",\"\",'PLAN d''ACTION'!C232&CHAR(10))&IF('PLAN d''ACTION'!F233=\"\",\"\",'PLAN d''ACTION'!C233&CHAR(10))&IF('PLAN d''ACTION'!F234=\"\",\"\",'PLAN d''ACTION'!C234&CHAR(10))&IF('PLAN d''ACTION'!F235=\"\",\"\",'PLAN d''ACTION'!C235&CHAR(10))&IF('PLAN d''ACTION'!F236=\"\",\"\",'PLAN d''ACTION'!C236&CHAR(10))&IF('PLAN d''ACTION'!F237=\"\",\"\",'PLAN d''ACTION'!C237&CHAR(10))&IF('PLAN d''ACTION'!F238=\"\",\"\",'PLAN d''ACTION'!C238&CHAR(10))&IF('PLAN d''ACTION'!F239=\"\",\"\",'PLAN d''ACTION'!C239&CHAR(10))&IF('PLAN d''ACTION'!F240=\"\",\"\",'PLAN d''ACTION'!C240&CHAR(10))&IF('PLAN d''ACTION'!F241=\"\",\"\",'PLAN d''ACTION'!C241&CHAR(10))&IF('PLAN d''ACTION'!F242=\"\",\"\",'PLAN d''ACTION'!C242&CHAR(10))&IF('PLAN d''ACTION'!F243=\"\",\"\",'PLAN d''ACTION'!C243&CHAR(10))&IF('PLAN d''ACTION'!F244=\"\",\"\",'PLAN d''ACTION'!C244&CHAR(10))&IF('PLAN d''ACTION'!F245=\"\",\"\",'PLAN d''ACTION'!C245&CHAR(10))&IF('PLAN d''ACTION'!F246=\"\",\"\",'PLAN d''ACTION'!C246&CHAR(10))&IF('PLAN d''ACTION'!F247=\"\",\"\",'PLAN d''ACTION'!C247&CHAR(10))&IF('PLAN d''ACTION'!F248=\"\",\"\",'PLAN d''ACTION'!C248&CHAR(10))&IF('PLAN d''ACTION'!F249=\"\",\"\",'PLAN d''ACTION'!C249&CHAR(10))&IF('PLAN d''ACTION'!F250=\"\",\"\",'PLAN d''ACTION'!C250&CHAR(10))&IF('PLAN d''ACTION'!F251=\"\",\"\",'PLAN d''ACTION'!C251&CHAR(10))&IF('PLAN d''ACTION'!F252=\"\",\"\",'PLAN d''ACTION'!C252&CHAR(10))&IF('PLAN d''ACTION'!F253=\"\",\"\",'PLAN d''ACTION'!C253&CHAR(10))&IF('PLAN d''ACTION'!F254=\"\",\"\",'PLAN d''ACTION'!C254&CHAR(10))&IF('PLAN d''ACTION'!F255=\"\",\"\",'PLAN d''ACTION'!C255&CHAR(10))&IF('PLAN d''ACTION'!F256=\"\",\"\",'PLAN d''ACTION'!C256&CHAR(10))&IF('PLAN d''ACTION'!F257=\"\",\"\",'PLAN d''ACTION'!C257&CHAR(10))&IF('PLAN d''ACTION'!F258=\"\",\"\",'PLAN d''ACTION'!C258&CHAR(10))&IF('PLAN d''ACTION'!F259=\"\",\"\",'PLAN d''ACTION'!C259&CHAR(10))&IF('PLAN d''ACTION'!F260=\"\",\"\",'PLAN d''ACTION'!C260&CHAR(10))&IF('PLAN d''ACTION'!F261=\"\",\"\",'PLAN d''ACTION'!C261)","v":""}]
[]
[]
["Commentaire"]
[]
[]
[]
[]
[]
[]
[]
["IV","Gestion des soins"]
[]
[]
["L'évaluation des moyens de maitrise selon l'autoévaluation du GREPHH:"]
[]
[null,null,"% objectifs atteints"]
[null,"Gestion des soins",{"$f":"Rapport!G27","v":0}]
[]
[]
[]
[]
[]
[]
[]
[]
[]
[]
[]
[]
[]
[]
[]
[]
[]
[]
[]
[]
["IV.1","Actes infirmiers et nursing"]
[]
["Les points faibles prioritaires sont:"]
[]
[{"$f":"IF(C559<20,\"Défaut de procédures Actes infirmiers et nursing\"&CHAR(10),\"\")&IF(COUNTIF('Eval 4'!E4,\"*élevé*\"),'Eval 4'!B4&CHAR(10),\"\")&IF(COUNTIF('Eval 4'!E5,\"*élevé*\"),'Eval 4'!B5&CHAR(10),\"\")&IF(COUNTIF('Eval 4'!E6,\"*élevé*\"),'Eval 4'!B6&CHAR(10),\"\")&IF(COUNTIF('Eval 4'!E7,\"*élevé*\"),'Eval 4'!B7&CHAR(10),\"\")&IF(COUNTIF('Eval 4'!E8,\"*élevé*\"),'Eval 4'!B8&CHAR(10),\"\")&IF(COUNTIF('Eval 4'!E9,\"*élevé*\"),'Eval 4'!B9&CHAR(10),\"\")&IF(COUNTIF('Eval 4'!E10,\"*élevé*\"),'Eval 4'!B10&CHAR(10),\"\")&IF(COUNTIF('Eval 4'!E11,\"*élevé*\"),'Eval 4'!B11&CHAR(10),\"\")&IF(COUNTIF('Eval 4'!E12,\"*élevé*\"),'Eval 4'!B12&CHAR(10),\"\")&IF(COUNTIF('Eval 4'!E13,\"*élevé*\"),'Eval 4'!B13,\"\")","v":"Défaut de procédures Actes infirmiers et nursing\n"}]
[]
["Les points à améliorer sont:"]
[]
[{"$f":"IF(AND(C559>=20,C559<80),\"Procédures Actes infirmiers et nursing à optimiser\"&CHAR(10),\"\")&IF(COUNTIF('Eval 4'!E4,\"*moyen*\"),'Eval 4'!B4&CHAR(10),\"\")&IF(COUNTIF('Eval 4'!E5,\"*moyen*\"),'Eval 4'!B5&CHAR(10),\"\")&IF(COUNTIF('Eval 4'!E6,\"*moyen*\"),'Eval 4'!B6&CHAR(10),\"\")&IF(COUNTIF('Eval 4'!E7,\"*moyen*\"),'Eval 4'!B7&CHAR(10),\"\")&IF(COUNTIF('Eval 4'!E8,\"*moyen*\"),'Eval 4'!B8&CHAR(10),\"\")&IF(COUNTIF('Eval 4'!E9,\"*moyen*\"),'Eval 4'!B9&CHAR(10),\"\")&IF(COUNTIF('Eval 4'!E10,\"*moyen*\"),'Eval 4'!B10&CHAR(10),\"\")&IF(COUNTIF('Eval 4'!E11,\"*moyen*\"),'Eval 4'!B11&CHAR(10),\"\")&IF(COUNTIF('Eval 4'!E12,\"*moyen*\"),'Eval 4'!B12&CHAR(10),\"\")&IF(COUNTIF('Eval 4'!E13,\"*moyen*\"),'Eval 4'!B13,\"\")","v":"Risque de pneumopathie d'inhalation\n"}]
[]
["L'évaluation des moyens de maitrise selon l'autoévaluation du GREPHH:"]
[]
[null,null,"% objectifs atteints"]
[null,"Actes infirmiers et nursing",{"$f":"Rapport!G102","v":0}]
[]
["Indicateurs de suivi: \nAutoévaluation du GREPHH"]
[]
["Autre indicateur de suivi:"]
[]
[]
[]
[]
[]
["Le plan d'action prévoit de façon prioritaire:"]
[]
[{"$f":"IF('PLAN d''ACTION'!D264=\"\",\"\",'PLAN d''ACTION'!C264&CHAR(10))&IF('PLAN d''ACTION'!D265=\"\",\"\",'PLAN d''ACTION'!C265&CHAR(10))&IF('PLAN d''ACTION'!D266=\"\",\"\",'PLAN d''ACTION'!C266&CHAR(10))&IF('PLAN d''ACTION'!D267=\"\",\"\",'PLAN d''ACTION'!C267&CHAR(10))&IF('PLAN d''ACTION'!D268=\"\",\"\",'PLAN d''ACTION'!C268&CHAR(10))&IF('PLAN d''ACTION'!D269=\"\",\"\",'PLAN d''ACTION'!C269&CHAR(10))&IF('PLAN d''ACTION'!D270=\"\",\"\",'PLAN d''ACTION'!C270&CHAR(10))&IF('PLAN d''ACTION'!D271=\"\",\"\",'PLAN d''ACTION'!C271&CHAR(10))&IF('PLAN d''ACTION'!D272=\"\",\"\",'PLAN d''ACTION'!C272&CHAR(10))&IF('PLAN d''ACTION'!D273=\"\",\"\",'PLAN d''ACTION'!C273&CHAR(10))&IF('PLAN d''ACTION'!D274=\"\",\"\",'PLAN d''ACTION'!C274&CHAR(10))&IF('PLAN d''ACTION'!D275=\"\",\"\",'PLAN d''ACTION'!C275&CHAR(10))&IF('PLAN d''ACTION'!D276=\"\",\"\",'PLAN d''ACTION'!C276&CHAR(10))&IF('PLAN d''ACTION'!D277=\"\",\"\",'PLAN d''ACTION'!C277&CHAR(10))&IF('PLAN d''ACTION'!D278=\"\",\"\",'PLAN d''ACTION'!C278&CHAR(10))&IF('PLAN d''ACTION'!D279=\"\",\"\",'PLAN d''ACTION'!C279&CHAR(10))&IF('PLAN d''ACTION'!D280=\"\",\"\",'PLAN d''ACTION'!C280&CHAR(10))&IF('PLAN d''ACTION'!D281=\"\",\"\",'PLAN d''ACTION'!C281&CHAR(10))&IF('PLAN d''ACTION'!D282=\"\",\"\",'PLAN d''ACTION'!C282&CHAR(10))&IF('PLAN d''ACTION'!D283=\"\",\"\",'PLAN d''ACTION'!C283&CHAR(10))&IF('PLAN d''ACTION'!D284=\"\",\"\",'PLAN d''ACTION'!C284&CHAR(10))&IF('PLAN d''ACTION'!D285=\"\",\"\",'PLAN d''ACTION'!C285&CHAR(10))&IF('PLAN d''ACTION'!D286=\"\",\"\",'PLAN d''ACTION'!C286&CHAR(10))&IF('PLAN d''ACTION'!D287=\"\",\"\",'PLAN d''ACTION'!C287&CHAR(10))&IF('PLAN d''ACTION'!D288=\"\",\"\",'PLAN d''ACTION'!C288&CHAR(10))&IF('PLAN d''ACTION'!D289=\"\",\"\",'PLAN d''ACTION'!C289&CHAR(10))&IF('PLAN d''ACTION'!D290=\"\",\"\",'PLAN d''ACTION'!C290&CHAR(10))&IF('PLAN d''ACTION'!D291=\"\",\"\",'PLAN d''ACTION'!C291&CHAR(10))&IF('PLAN d''ACTION'!D292=\"\",\"\",'PLAN d''ACTION'!C292&CHAR(10))&IF('PLAN d''ACTION'!D293=\"\",\"\",'PLAN d''ACTION'!C293&CHAR(10))&IF('PLAN d''ACTION'!D294=\"\",\"\",'PLAN d''ACTION'!C294&CHAR(10))&IF('PLAN d''ACTION'!D295=\"\",\"\",'PLAN d''ACTION'!C295&CHAR(10))&IF('PLAN d''ACTION'!D298=\"\",\"\",'PLAN d''ACTION'!C298&CHAR(10))&IF('PLAN d''ACTION'!D299=\"\",\"\",'PLAN d''ACTION'!C299&CHAR(10))&IF('PLAN d''ACTION'!D300=\"\",\"\",'PLAN d''ACTION'!C300&CHAR(10))&IF('PLAN d''ACTION'!D301=\"\",\"\",'PLAN d''ACTION'!C301&CHAR(10))&IF('PLAN d''ACTION'!D302=\"\",\"\",'PLAN d''ACTION'!C302&CHAR(10))&IF('PLAN d''ACTION'!D303=\"\",\"\",'PLAN d''ACTION'!C303&CHAR(10))&IF('PLAN d''ACTION'!D296=\"\",\"\",'PLAN d''ACTION'!C296&CHAR(10))&IF('PLAN d''ACTION'!D297=\"\",\"\",'PLAN d''ACTION'!C297)","v":""}]
[]
[]
["Le plan d'action prévoit également:"]
[]
[{"$f":"IF('PLAN d''ACTION'!E264=\"\",\"\",'PLAN d''ACTION'!C264&CHAR(10))&IF('PLAN d''ACTION'!E265=\"\",\"\",'PLAN d''ACTION'!C265&CHAR(10))&IF('PLAN d''ACTION'!E266=\"\",\"\",'PLAN d''ACTION'!C266&CHAR(10))&IF('PLAN d''ACTION'!E267=\"\",\"\",'PLAN d''ACTION'!C267&CHAR(10))&IF('PLAN d''ACTION'!E268=\"\",\"\",'PLAN d''ACTION'!C268&CHAR(10))&IF('PLAN d''ACTION'!E269=\"\",\"\",'PLAN d''ACTION'!C269&CHAR(10))&IF('PLAN d''ACTION'!E270=\"\",\"\",'PLAN d''ACTION'!C270&CHAR(10))&IF('PLAN d''ACTION'!E271=\"\",\"\",'PLAN d''ACTION'!C271&CHAR(10))&IF('PLAN d''ACTION'!E272=\"\",\"\",'PLAN d''ACTION'!C272&CHAR(10))&IF('PLAN d''ACTION'!E273=\"\",\"\",'PLAN d''ACTION'!C273&CHAR(10))&IF('PLAN d''ACTION'!E274=\"\",\"\",'PLAN d''ACTION'!C274&CHAR(10))&IF('PLAN d''ACTION'!E275=\"\",\"\",'PLAN d''ACTION'!C275&CHAR(10))&IF('PLAN d''ACTION'!E276=\"\",\"\",'PLAN d''ACTION'!C276&CHAR(10))&IF('PLAN d''ACTION'!E277=\"\",\"\",'PLAN d''ACTION'!C277&CHAR(10))&IF('PLAN d''ACTION'!E278=\"\",\"\",'PLAN d''ACTION'!C278&CHAR(10))&IF('PLAN d''ACTION'!E279=\"\",\"\",'PLAN d''ACTION'!C279&CHAR(10))&IF('PLAN d''ACTION'!E280=\"\",\"\",'PLAN d''ACTION'!C280&CHAR(10))&IF('PLAN d''ACTION'!E281=\"\",\"\",'PLAN d''ACTION'!C281&CHAR(10))&IF('PLAN d''ACTION'!E282=\"\",\"\",'PLAN d''ACTION'!C282&CHAR(10))&IF('PLAN d''ACTION'!E283=\"\",\"\",'PLAN d''ACTION'!C283&CHAR(10))&IF('PLAN d''ACTION'!E284=\"\",\"\",'PLAN d''ACTION'!C284&CHAR(10))&IF('PLAN d''ACTION'!E285=\"\",\"\",'PLAN d''ACTION'!C285&CHAR(10))&IF('PLAN d''ACTION'!E286=\"\",\"\",'PLAN d''ACTION'!C286&CHAR(10))&IF('PLAN d''ACTION'!E287=\"\",\"\",'PLAN d''ACTION'!C287&CHAR(10))&IF('PLAN d''ACTION'!E288=\"\",\"\",'PLAN d''ACTION'!C288&CHAR(10))&IF('PLAN d''ACTION'!E289=\"\",\"\",'PLAN d''ACTION'!C289&CHAR(10))&IF('PLAN d''ACTION'!E290=\"\",\"\",'PLAN d''ACTION'!C290&CHAR(10))&IF('PLAN d''ACTION'!E291=\"\",\"\",'PLAN d''ACTION'!C291&CHAR(10))&IF('PLAN d''ACTION'!E292=\"\",\"\",'PLAN d''ACTION'!C292&CHAR(10))&IF('PLAN d''ACTION'!E293=\"\",\"\",'PLAN d''ACTION'!C293&CHAR(10))&IF('PLAN d''ACTION'!E294=\"\",\"\",'PLAN d''ACTION'!C294&CHAR(10))&IF('PLAN d''ACTION'!E295=\"\",\"\",'PLAN d''ACTION'!C295&CHAR(10))&IF('PLAN d''ACTION'!E298=\"\",\"\",'PLAN d''ACTION'!C298&CHAR(10))&IF('PLAN d''ACTION'!E299=\"\",\"\",'PLAN d''ACTION'!C299&CHAR(10))&IF('PLAN d''ACTION'!E300=\"\",\"\",'PLAN d''ACTION'!C300&CHAR(10))&IF('PLAN d''ACTION'!E301=\"\",\"\",'PLAN d''ACTION'!C301&CHAR(10))&IF('PLAN d''ACTION'!E302=\"\",\"\",'PLAN d''ACTION'!C302&CHAR(10))&IF('PLAN d''ACTION'!E303=\"\",\"\",'PLAN d''ACTION'!C303&CHAR(10))&IF('PLAN d''ACTION'!E296=\"\",\"\",'PLAN d''ACTION'!C296&CHAR(10))&IF('PLAN d''ACTION'!E297=\"\",\"\",'PLAN d''ACTION'!C297&CHAR(10))&IF('PLAN d''ACTION'!F264=\"\",\"\",'PLAN d''ACTION'!C264&CHAR(10))&IF('PLAN d''ACTION'!F265=\"\",\"\",'PLAN d''ACTION'!C265&CHAR(10))&IF('PLAN d''ACTION'!F266=\"\",\"\",'PLAN d''ACTION'!C266&CHAR(10))&IF('PLAN d''ACTION'!F267=\"\",\"\",'PLAN d''ACTION'!C267&CHAR(10))&IF('PLAN d''ACTION'!F268=\"\",\"\",'PLAN d''ACTION'!C268&CHAR(10))&IF('PLAN d''ACTION'!F269=\"\",\"\",'PLAN d''ACTION'!C269&CHAR(10))&IF('PLAN d''ACTION'!F270=\"\",\"\",'PLAN d''ACTION'!C270&CHAR(10))&IF('PLAN d''ACTION'!F271=\"\",\"\",'PLAN d''ACTION'!C271&CHAR(10))&IF('PLAN d''ACTION'!F272=\"\",\"\",'PLAN d''ACTION'!C272&CHAR(10))&IF('PLAN d''ACTION'!F273=\"\",\"\",'PLAN d''ACTION'!C273&CHAR(10))&IF('PLAN d''ACTION'!F274=\"\",\"\",'PLAN d''ACTION'!C274&CHAR(10))&IF('PLAN d''ACTION'!F275=\"\",\"\",'PLAN d''ACTION'!C275&CHAR(10))&IF('PLAN d''ACTION'!F276=\"\",\"\",'PLAN d''ACTION'!C276&CHAR(10))&IF('PLAN d''ACTION'!F277=\"\",\"\",'PLAN d''ACTION'!C277&CHAR(10))&IF('PLAN d''ACTION'!F278=\"\",\"\",'PLAN d''ACTION'!C278&CHAR(10))&IF('PLAN d''ACTION'!F279=\"\",\"\",'PLAN d''ACTION'!C279&CHAR(10))&IF('PLAN d''ACTION'!F280=\"\",\"\",'PLAN d''ACTION'!C280&CHAR(10))&IF('PLAN d''ACTION'!F281=\"\",\"\",'PLAN d''ACTION'!C281&CHAR(10))&IF('PLAN d''ACTION'!F282=\"\",\"\",'PLAN d''ACTION'!C282&CHAR(10))&IF('PLAN d''ACTION'!F283=\"\",\"\",'PLAN d''ACTION'!C283&CHAR(10))&IF('PLAN d''ACTION'!F284=\"\",\"\",'PLAN d''ACTION'!C284&CHAR(10))&IF('PLAN d''ACTION'!F285=\"\",\"\",'PLAN d''ACTION'!C285&CHAR(10))&IF('PLAN d''ACTION'!F286=\"\",\"\",'PLAN d''ACTION'!C286&CHAR(10))&IF('PLAN d''ACTION'!F287=\"\",\"\",'PLAN d''ACTION'!C287&CHAR(10))&IF('PLAN d''ACTION'!F288=\"\",\"\",'PLAN d''ACTION'!C288&CHAR(10))&IF('PLAN d''ACTION'!F289=\"\",\"\",'PLAN d''ACTION'!C289&CHAR(10))&IF('PLAN d''ACTION'!F290=\"\",\"\",'PLAN d''ACTION'!C290&CHAR(10))&IF('PLAN d''ACTION'!F291=\"\",\"\",'PLAN d''ACTION'!C291&CHAR(10))&IF('PLAN d''ACTION'!F292=\"\",\"\",'PLAN d''ACTION'!C292&CHAR(10))&IF('PLAN d''ACTION'!F293=\"\",\"\",'PLAN d''ACTION'!C293&CHAR(10))&IF('PLAN d''ACTION'!F294=\"\",\"\",'PLAN d''ACTION'!C294&CHAR(10))&IF('PLAN d''ACTION'!F295=\"\",\"\",'PLAN d''ACTION'!C295&CHAR(10))&IF('PLAN d''ACTION'!F298=\"\",\"\",'PLAN d''ACTION'!C298&CHAR(10))&IF('PLAN d''ACTION'!F299=\"\",\"\",'PLAN d''ACTION'!C299&CHAR(10))&IF('PLAN d''ACTION'!F300=\"\",\"\",'PLAN d''ACTION'!C300&CHAR(10))&IF('PLAN d''ACTION'!F301=\"\",\"\",'PLAN d''ACTION'!C301&CHAR(10))&IF('PLAN d''ACTION'!F302=\"\",\"\",'PLAN d''ACTION'!C302&CHAR(10))&IF('PLAN d''ACTION'!F303=\"\",\"\",'PLAN d''ACTION'!C303&CHAR(10))&IF('PLAN d''ACTION'!F296=\"\",\"\",'PLAN d''ACTION'!C296&CHAR(10))&IF('PLAN d''ACTION'!F297=\"\",\"\",'PLAN d''ACTION'!C297)","v":""}]
[]
[]
[]
["Commentaire"]
[]
[]
[]
[]
[]
["IV.2","Antiseptiques"]
[]
["Les points faibles prioritaires sont:"]
[]
[{"$f":"IF(C599<20,\"Défaut de procédures et/ou bonnes pratiques concernant les antiseptiques\"&CHAR(10),\"\")&IF(COUNTIF('Eval 4'!E14,\"*élevé*\"),'Eval 4'!B14&CHAR(10),\"\")&IF(COUNTIF('Eval 4'!E15,\"*élevé*\"),'Eval 4'!B15,\"\")","v":"Défaut de procédures et/ou bonnes pratiques concernant les antiseptiques\n"}]
[]
["Les points à améliorer sont:"]
[]
[{"$f":"IF(AND(C599>=20,C599<80),\"Procédures et/ou bonnes pratiques concernant les antiseptiques à optimiser\"&CHAR(10),\"\")&IF(COUNTIF('Eval 4'!E14,\"*moyen*\"),'Eval 4'!B14&CHAR(10),\"\")&IF(COUNTIF('Eval 4'!E15,\"*moyen*\"),'Eval 4'!B15,\"\")","v":""}]
[]
["L'évaluation des moyens de maitrise selon l'autoévaluation du GREPHH:"]
[]
[null,null,"% objectifs atteints"]
[null,"Antiseptiques",{"$f":"Rapport!G103","v":0}]
[]
["Indicateurs de suivi: \nAutoévaluation du GREPHH"]
[]
["Le plan d'action prévoit de façon prioritaire:"]
[]
[{"$f":"IF('PLAN d''ACTION'!D304=\"\",\"\",'PLAN d''ACTION'!C304&CHAR(10))&IF('PLAN d''ACTION'!D305=\"\",\"\",'PLAN d''ACTION'!C305&CHAR(10))&IF('PLAN d''ACTION'!D306=\"\",\"\",'PLAN d''ACTION'!C306&CHAR(10))&IF('PLAN d''ACTION'!D307=\"\",\"\",'PLAN d''ACTION'!C307&CHAR(10))&IF('PLAN d''ACTION'!D308=\"\",\"\",'PLAN d''ACTION'!C308&CHAR(10))&IF('PLAN d''ACTION'!D309=\"\",\"\",'PLAN d''ACTION'!C309&CHAR(10))&IF('PLAN d''ACTION'!D310=\"\",\"\",'PLAN d''ACTION'!C310&CHAR(10))&IF('PLAN d''ACTION'!D311=\"\",\"\",'PLAN d''ACTION'!C311&CHAR(10))&IF('PLAN d''ACTION'!D312=\"\",\"\",'PLAN d''ACTION'!C312&CHAR(10))&IF('PLAN d''ACTION'!D313=\"\",\"\",'PLAN d''ACTION'!C313&CHAR(10))&IF('PLAN d''ACTION'!D314=\"\",\"\",'PLAN d''ACTION'!C314)","v":""}]
[]
[]
["Le plan d'action prévoit également:"]
[]
[{"$f":"IF('PLAN d''ACTION'!E304=\"\",\"\",'PLAN d''ACTION'!C304&CHAR(10))&IF('PLAN d''ACTION'!E305=\"\",\"\",'PLAN d''ACTION'!C305&CHAR(10))&IF('PLAN d''ACTION'!E306=\"\",\"\",'PLAN d''ACTION'!C306&CHAR(10))&IF('PLAN d''ACTION'!E307=\"\",\"\",'PLAN d''ACTION'!C307&CHAR(10))&IF('PLAN d''ACTION'!E308=\"\",\"\",'PLAN d''ACTION'!C308&CHAR(10))&IF('PLAN d''ACTION'!E309=\"\",\"\",'PLAN d''ACTION'!C309&CHAR(10))&IF('PLAN d''ACTION'!E310=\"\",\"\",'PLAN d''ACTION'!C310&CHAR(10))&IF('PLAN d''ACTION'!E311=\"\",\"\",'PLAN d''ACTION'!C311&CHAR(10))&IF('PLAN d''ACTION'!E312=\"\",\"\",'PLAN d''ACTION'!C312&CHAR(10))&IF('PLAN d''ACTION'!E313=\"\",\"\",'PLAN d''ACTION'!C313&CHAR(10))&IF('PLAN d''ACTION'!E314=\"\",\"\",'PLAN d''ACTION'!C314&CHAR(10))&IF('PLAN d''ACTION'!F304=\"\",\"\",'PLAN d''ACTION'!C304&CHAR(10))&IF('PLAN d''ACTION'!F305=\"\",\"\",'PLAN d''ACTION'!C305&CHAR(10))&IF('PLAN d''ACTION'!F306=\"\",\"\",'PLAN d''ACTION'!C306&CHAR(10))&IF('PLAN d''ACTION'!F307=\"\",\"\",'PLAN d''ACTION'!C307&CHAR(10))&IF('PLAN d''ACTION'!F308=\"\",\"\",'PLAN d''ACTION'!C308&CHAR(10))&IF('PLAN d''ACTION'!F309=\"\",\"\",'PLAN d''ACTION'!C309&CHAR(10))&IF('PLAN d''ACTION'!F310=\"\",\"\",'PLAN d''ACTION'!C310&CHAR(10))&IF('PLAN d''ACTION'!F311=\"\",\"\",'PLAN d''ACTION'!C311&CHAR(10))&IF('PLAN d''ACTION'!F312=\"\",\"\",'PLAN d''ACTION'!C312&CHAR(10))&IF('PLAN d''ACTION'!F313=\"\",\"\",'PLAN d''ACTION'!C313&CHAR(10))&IF('PLAN d''ACTION'!F314=\"\",\"\",'PLAN d''ACTION'!C314)","v":""}]
[]
[]
[]
["Commentaire"]
[]
[]
[]
[]
[]
[]
[]
["IV.3","Précautions standard"]
[]
["Les points faibles prioritaires sont:"]
[]
[{"$f":"IF(C637<20,\"Défaut de moyens et/ou politique de bonnes pratiques concernant les Précautions standard\"&CHAR(10),\"\")&IF(COUNTIF('Eval 4'!E16,\"*élevé*\"),'Eval 4'!B16&CHAR(10),\"\")&IF(COUNTIF('Eval 4'!E17,\"*élevé*\"),'Eval 4'!B17&CHAR(10),\"\")&IF(COUNTIF('Eval 4'!E18,\"*élevé*\"),'Eval 4'!B18&CHAR(10),\"\")&IF(COUNTIF('Eval 4'!E19,\"*élevé*\"),'Eval 4'!B19&CHAR(10),\"\")&IF(COUNTIF('Eval 4'!E20,\"*élevé*\"),'Eval 4'!B20,\"\")","v":"Défaut de moyens et/ou politique de bonnes pratiques concernant les Précautions standard\n"}]
[]
["Les points à améliorer sont:"]
[]
[{"$f":"IF(AND(C637>=20,C637<80),\"Défaut de moyens et/ou politique de bonnes pratiques concernant les Précautions standard\"&CHAR(10),\"\")&IF(COUNTIF('Eval 4'!E16,\"*moyen*\"),'Eval 4'!B16&CHAR(10),\"\")&IF(COUNTIF('Eval 4'!E17,\"*moyen*\"),'Eval 4'!B17&CHAR(10),\"\")&IF(COUNTIF('Eval 4'!E18,\"*moyen*\"),'Eval 4'!B18&CHAR(10),\"\")&IF(COUNTIF('Eval 4'!E19,\"*moyen*\"),'Eval 4'!B19&CHAR(10),\"\")&IF(COUNTIF('Eval 4'!E20,\"*moyen*\"),'Eval 4'!B20,\"\")","v":""}]
[]
["L'évaluation des moyens de maitrise (procédure et mise en oeuvre):"]
[]
["Autoévaluation du GREPHH"]
[]
[null,null,"% objectifs atteints"]
[null,"Précautions standard",{"$f":"Rapport!G104","v":0}]
[]
["Suivi de la consommation de solution hydroalcoolique par journée d'hébergement"]
[]
[]
[]
[]
[]
[]
[]
[]
[]
[]
[]
[]
["Pour information objectif ICSHA2 en USLD 4 frictions/JH"]
[]
["Suivi de la consommation de tabliers UU par journée d'hébergement"]
[]
[]
[]
[]
[]
[]
[]
[null,"Audit zéro bijou"]
[]
[]
[]
[]
[]
["Pour information, 1 tablier par soignant pour chaque soin mouillant (nursing, changes, pansements….)"]
[]
["Suivi de l'audit zéro bijou"]
[]
[]
[]
[]
[]
[]
[]
[]
[]
[]
[]
[]
[]
[]
["Indicateurs de suivi: \nAutoévaluation du GREPHH\nSuivi des consommations SHA et tabliers UU\nAudit zéro bijou"]
[]
[]
["Le plan d'action prévoit de façon prioritaire:"]
[]
[{"$f":"IF('PLAN d''ACTION'!D315=\"\",\"\",'PLAN d''ACTION'!C315&CHAR(10))&IF('PLAN d''ACTION'!D316=\"\",\"\",'PLAN d''ACTION'!C316&CHAR(10))&IF('PLAN d''ACTION'!D317=\"\",\"\",'PLAN d''ACTION'!C317&CHAR(10))&IF('PLAN d''ACTION'!D318=\"\",\"\",'PLAN d''ACTION'!C318&CHAR(10))&IF('PLAN d''ACTION'!D319=\"\",\"\",'PLAN d''ACTION'!C319&CHAR(10))&IF('PLAN d''ACTION'!D320=\"\",\"\",'PLAN d''ACTION'!C320&CHAR(10))&IF('PLAN d''ACTION'!D321=\"\",\"\",'PLAN d''ACTION'!C321&CHAR(10))&IF('PLAN d''ACTION'!D322=\"\",\"\",'PLAN d''ACTION'!C322&CHAR(10))&IF('PLAN d''ACTION'!D323=\"\",\"\",'PLAN d''ACTION'!C323&CHAR(10))&IF('PLAN d''ACTION'!D324=\"\",\"\",'PLAN d''ACTION'!C324&CHAR(10))&IF('PLAN d''ACTION'!D325=\"\",\"\",'PLAN d''ACTION'!C325&CHAR(10))&IF('PLAN d''ACTION'!D326=\"\",\"\",'PLAN d''ACTION'!C326&CHAR(10))&IF('PLAN d''ACTION'!D327=\"\",\"\",'PLAN d''ACTION'!C327&CHAR(10))&IF('PLAN d''ACTION'!D328=\"\",\"\",'PLAN d''ACTION'!C328&CHAR(10))&IF('PLAN d''ACTION'!D329=\"\",\"\",'PLAN d''ACTION'!C329)","v":""}]
[]
[]
["Le plan d'action prévoit également:"]
[]
[{"$f":"IF('PLAN d''ACTION'!E315=\"\",\"\",'PLAN d''ACTION'!C315&CHAR(10))&IF('PLAN d''ACTION'!E316=\"\",\"\",'PLAN d''ACTION'!C316&CHAR(10))&IF('PLAN d''ACTION'!E317=\"\",\"\",'PLAN d''ACTION'!C317&CHAR(10))&IF('PLAN d''ACTION'!E318=\"\",\"\",'PLAN d''ACTION'!C318&CHAR(10))&IF('PLAN d''ACTION'!E319=\"\",\"\",'PLAN d''ACTION'!C319&CHAR(10))&IF('PLAN d''ACTION'!E320=\"\",\"\",'PLAN d''ACTION'!C320&CHAR(10))&IF('PLAN d''ACTION'!E321=\"\",\"\",'PLAN d''ACTION'!C321&CHAR(10))&IF('PLAN d''ACTION'!E322=\"\",\"\",'PLAN d''ACTION'!C322&CHAR(10))&IF('PLAN d''ACTION'!E323=\"\",\"\",'PLAN d''ACTION'!C323&CHAR(10))&IF('PLAN d''ACTION'!E324=\"\",\"\",'PLAN d''ACTION'!C324&CHAR(10))&IF('PLAN d''ACTION'!E325=\"\",\"\",'PLAN d''ACTION'!C325&CHAR(10))&IF('PLAN d''ACTION'!E326=\"\",\"\",'PLAN d''ACTION'!C326&CHAR(10))&IF('PLAN d''ACTION'!E327=\"\",\"\",'PLAN d''ACTION'!C327&CHAR(10))&IF('PLAN d''ACTION'!E328=\"\",\"\",'PLAN d''ACTION'!C328&CHAR(10))&IF('PLAN d''ACTION'!E329=\"\",\"\",'PLAN d''ACTION'!C329&CHAR(10))&IF('PLAN d''ACTION'!F315=\"\",\"\",'PLAN d''ACTION'!C315&CHAR(10))&IF('PLAN d''ACTION'!F316=\"\",\"\",'PLAN d''ACTION'!C316&CHAR(10))&IF('PLAN d''ACTION'!F317=\"\",\"\",'PLAN d''ACTION'!C317&CHAR(10))&IF('PLAN d''ACTION'!F318=\"\",\"\",'PLAN d''ACTION'!C318&CHAR(10))&IF('PLAN d''ACTION'!F319=\"\",\"\",'PLAN d''ACTION'!C319&CHAR(10))&IF('PLAN d''ACTION'!F320=\"\",\"\",'PLAN d''ACTION'!C320&CHAR(10))&IF('PLAN d''ACTION'!F321=\"\",\"\",'PLAN d''ACTION'!C321&CHAR(10))&IF('PLAN d''ACTION'!F322=\"\",\"\",'PLAN d''ACTION'!C322&CHAR(10))&IF('PLAN d''ACTION'!F323=\"\",\"\",'PLAN d''ACTION'!C323&CHAR(10))&IF('PLAN d''ACTION'!F324=\"\",\"\",'PLAN d''ACTION'!C324&CHAR(10))&IF('PLAN d''ACTION'!F325=\"\",\"\",'PLAN d''ACTION'!C325&CHAR(10))&IF('PLAN d''ACTION'!F326=\"\",\"\",'PLAN d''ACTION'!C326&CHAR(10))&IF('PLAN d''ACTION'!F327=\"\",\"\",'PLAN d''ACTION'!C327&CHAR(10))&IF('PLAN d''ACTION'!F328=\"\",\"\",'PLAN d''ACTION'!C328&CHAR(10))&IF('PLAN d''ACTION'!F329=\"\",\"\",'PLAN d''ACTION'!C329)","v":""}]
[]
[]
["Commentaire"]
[]
[]
[]
[]
[]
["IV.4","Précautions complémentaires d'hygiène"]
[]
["Les points faibles prioritaires sont:"]
[]
[{"$f":"IF(C718<20,\"Défaut de procédures et/ou formation concernant les Précautions complémentaires\"&CHAR(10),\"\")&IF(COUNTIF('Eval 4'!E21,\"*élevé*\"),'Eval 4'!B21&CHAR(10),\"\")&IF(COUNTIF('Eval 4'!E22,\"*élevé*\"),'Eval 4'!B22&CHAR(10),\"\")&IF(COUNTIF('Eval 4'!E23,\"*élevé*\"),'Eval 4'!B23&CHAR(10),\"\")&IF(COUNTIF('Eval 4'!E24,\"*élevé*\"),'Eval 4'!B24&CHAR(10),\"\")&IF(COUNTIF('Eval 4'!E25,\"*élevé*\"),'Eval 4'!B25,\"\")","v":"Défaut de procédures et/ou formation concernant les Précautions complémentaires\n"}]
[]
["Les points à améliorer sont:"]
[]
[{"$f":"IF(AND(C718>=20,C718<80),\"Procédures et/ou formation concernant les Précautions complémentaires à optimiser\"&CHAR(10),\"\")&IF(COUNTIF('Eval 4'!E21,\"*moyen*\"),'Eval 4'!B21&CHAR(10),\"\")&IF(COUNTIF('Eval 4'!E22,\"*moyen*\"),'Eval 4'!B22&CHAR(10),\"\")&IF(COUNTIF('Eval 4'!E23,\"*moyen*\"),'Eval 4'!B23&CHAR(10),\"\")&IF(COUNTIF('Eval 4'!E24,\"*moyen*\"),'Eval 4'!B24&CHAR(10),\"\")&IF(COUNTIF('Eval 4'!E25,\"*moyen*\"),'Eval 4'!B25,\"\")","v":""}]
[]
["L'évaluation des moyens de maitrise selon l'autoévaluation du GREPHH:"]
[]
[]
[null,null,"% objectifs atteints"]
[null,"Précautions complémentaires",{"$f":"Rapport!G105","v":0}]
[]
["Indicateurs de suivi: \nAutoévaluation du GREPHH"]
[]
[]
["Le plan d'action prévoit de façon prioritaire:"]
[]
[{"$f":"IF('PLAN d''ACTION'!D330=\"\",\"\",'PLAN d''ACTION'!C330&CHAR(10))&IF('PLAN d''ACTION'!D331=\"\",\"\",'PLAN d''ACTION'!C331&CHAR(10))&IF('PLAN d''ACTION'!D332=\"\",\"\",'PLAN d''ACTION'!C332&CHAR(10))&IF('PLAN d''ACTION'!D333=\"\",\"\",'PLAN d''ACTION'!C333&CHAR(10))&IF('PLAN d''ACTION'!D334=\"\",\"\",'PLAN d''ACTION'!C334&CHAR(10))&IF('PLAN d''ACTION'!D335=\"\",\"\",'PLAN d''ACTION'!C335&CHAR(10))&IF('PLAN d''ACTION'!D336=\"\",\"\",'PLAN d''ACTION'!C336&CHAR(10))&IF('PLAN d''ACTION'!D337=\"\",\"\",'PLAN d''ACTION'!C337&CHAR(10))&IF('PLAN d''ACTION'!D338=\"\",\"\",'PLAN d''ACTION'!C338&CHAR(10))&IF('PLAN d''ACTION'!D339=\"\",\"\",'PLAN d''ACTION'!C339)","v":""}]
[]
[]
["Le plan d'action prévoit également:"]
[]
[{"$f":"IF('PLAN d''ACTION'!E330=\"\",\"\",'PLAN d''ACTION'!C330&CHAR(10))&IF('PLAN d''ACTION'!E331=\"\",\"\",'PLAN d''ACTION'!C331&CHAR(10))&IF('PLAN d''ACTION'!E332=\"\",\"\",'PLAN d''ACTION'!C332&CHAR(10))&IF('PLAN d''ACTION'!E333=\"\",\"\",'PLAN d''ACTION'!C333&CHAR(10))&IF('PLAN d''ACTION'!E334=\"\",\"\",'PLAN d''ACTION'!C334&CHAR(10))&IF('PLAN d''ACTION'!E335=\"\",\"\",'PLAN d''ACTION'!C335&CHAR(10))&IF('PLAN d''ACTION'!E336=\"\",\"\",'PLAN d''ACTION'!C336&CHAR(10))&IF('PLAN d''ACTION'!E337=\"\",\"\",'PLAN d''ACTION'!C337&CHAR(10))&IF('PLAN d''ACTION'!E338=\"\",\"\",'PLAN d''ACTION'!C338&CHAR(10))&IF('PLAN d''ACTION'!E339=\"\",\"\",'PLAN d''ACTION'!C339&CHAR(10))&IF('PLAN d''ACTION'!F330=\"\",\"\",'PLAN d''ACTION'!C330&CHAR(10))&IF('PLAN d''ACTION'!F331=\"\",\"\",'PLAN d''ACTION'!C331&CHAR(10))&IF('PLAN d''ACTION'!F332=\"\",\"\",'PLAN d''ACTION'!C332&CHAR(10))&IF('PLAN d''ACTION'!F333=\"\",\"\",'PLAN d''ACTION'!C333&CHAR(10))&IF('PLAN d''ACTION'!F334=\"\",\"\",'PLAN d''ACTION'!C334&CHAR(10))&IF('PLAN d''ACTION'!F335=\"\",\"\",'PLAN d''ACTION'!C335&CHAR(10))&IF('PLAN d''ACTION'!F336=\"\",\"\",'PLAN d''ACTION'!C336&CHAR(10))&IF('PLAN d''ACTION'!F337=\"\",\"\",'PLAN d''ACTION'!C337&CHAR(10))&IF('PLAN d''ACTION'!F338=\"\",\"\",'PLAN d''ACTION'!C338&CHAR(10))&IF('PLAN d''ACTION'!F339=\"\",\"\",'PLAN d''ACTION'!C339)","v":""}]
[]
[]
["Commentaire"]
[]
[]
[]
[]
[]
["IV.5","Hygiène des résidents"]
[]
["Les points faibles prioritaires sont:"]
[]
[{"$f":"IF(C752<20,\"Défaut d'organisation de la mise en oeuvre de l'hygiène des résidents\"&CHAR(10),\"\")&IF(COUNTIF('Eval 4'!E26,\"*élevé*\"),'Eval 4'!B26&CHAR(10),\"\")&IF(COUNTIF('Eval 4'!E27,\"*élevé*\"),'Eval 4'!B27&CHAR(10),\"\")","v":"Défaut d'organisation de la mise en oeuvre de l'hygiène des résidents\n"}]
[]
["Les points à améliorer sont:"]
[]
[{"$f":"IF(AND(C752>=20,C752<80),\"Organisation de la mise en oeuvre de l'hygiène des résidents à optimiser\"&CHAR(10),\"\")&IF(COUNTIF('Eval 4'!E26,\"*moyen*\"),'Eval 4'!B26&CHAR(10),\"\")&IF(COUNTIF('Eval 4'!E27,\"*moyen*\"),'Eval 4'!B27&CHAR(10),\"\")","v":""}]
[]
["L'évaluation des moyens de maitrise selon l'autoévaluation du GREPHH:"]
[]
[null,null,"% objectifs atteints"]
[null,"Hygiène des résidents",{"$f":"Rapport!G106","v":0}]
[]
["Indicateurs de suivi: \nAutoévaluation du GREPHH"]
[]
[]
["Le plan d'action prévoit de façon prioritaire:"]
[]
[{"$f":"IF('PLAN d''ACTION'!D340=\"\",\"\",'PLAN d''ACTION'!C340&CHAR(10))&IF('PLAN d''ACTION'!D341=\"\",\"\",'PLAN d''ACTION'!C341&CHAR(10))&IF('PLAN d''ACTION'!D342=\"\",\"\",'PLAN d''ACTION'!C342&CHAR(10))&IF('PLAN d''ACTION'!D343=\"\",\"\",'PLAN d''ACTION'!C343&CHAR(10))&IF('PLAN d''ACTION'!D344=\"\",\"\",'PLAN d''ACTION'!C344)","v":""}]
[]
[]
["Le plan d'action prévoit également:"]
[]
[{"$f":"IF('PLAN d''ACTION'!E340=\"\",\"\",'PLAN d''ACTION'!C340&CHAR(10))&IF('PLAN d''ACTION'!E341=\"\",\"\",'PLAN d''ACTION'!C341&CHAR(10))&IF('PLAN d''ACTION'!E342=\"\",\"\",'PLAN d''ACTION'!C342&CHAR(10))&IF('PLAN d''ACTION'!E343=\"\",\"\",'PLAN d''ACTION'!C343&CHAR(10))&IF('PLAN d''ACTION'!E344=\"\",\"\",'PLAN d''ACTION'!C344&CHAR(10))&IF('PLAN d''ACTION'!F340=\"\",\"\",'PLAN d''ACTION'!C340&CHAR(10))&IF('PLAN d''ACTION'!F341=\"\",\"\",'PLAN d''ACTION'!C341&CHAR(10))&IF('PLAN d''ACTION'!F342=\"\",\"\",'PLAN d''ACTION'!C342&CHAR(10))&IF('PLAN d''ACTION'!F343=\"\",\"\",'PLAN d''ACTION'!C343&CHAR(10))&IF('PLAN d''ACTION'!F344=\"\",\"\",'PLAN d''ACTION'!C344)","v":""}]
[]
["Commentaire"]
[]
[]
[]
[]
[]
[]
["V","Vaccinations"]
[]
["Les points faibles prioritaires sont:"]
[]
[{"$f":"IF(C787<20,\"Défaut d'organisation de la vaccination contre les affections respiratoires\"&CHAR(10),\"\")&IF('Chapitre V'!C20<80%,\"Défaut de vaccination antigrippale des résidents\"&CHAR(10),\"\")&IF('Chapitre V'!C22<30%,\"Défaut de couverture vaccinale du personnel soignant\"&CHAR(10),\"\")&IF(AND(OR('Chapitre V'!C24=0,'Chapitre V'!C24=\"\")),\"Absence de suivi de la couverture vaccinale antipneumococcique des résidents\",\"\")","v":"Défaut d'organisation de la vaccination contre les affections respiratoires\nDéfaut de vaccination antigrippale des résidents\nDéfaut de couverture vaccinale du personnel soignant\nAbsence de suivi de la couverture vaccinale antipneumococcique des résidents"}]
[]
["Les points à améliorer sont:"]
[]
[{"$f":"IF(AND(C787>=20,C787<80),\"Organisation de la vaccination contre les affections respiratoires à optimiser\"&CHAR(10),\"\")&IF(AND('Chapitre V'!C20>=80%,'Chapitre V'!C20<90%),\"Vaccination antigrippale des résidents à optimiser\"&CHAR(10),\"\")&IF(AND('Chapitre V'!C22>=30%,'Chapitre V'!C22<50%),\"Couverture vaccinale du personnel soignant à optimiser\"&CHAR(10),\"\")","v":""}]
[]
["L'évaluation des moyens de maitrise selon l'autoévaluation du GREPHH:"]
[]
[]
[null,null,"% objectifs atteints"]
[null,"Vaccinations",{"$f":"Rapport!G118","v":0}]
[]
["Indicateurs de suivi: \nSuivi annuel de l'autoévaluation du GREPHH\nSuivi de la couverture vaccinale du personnel soignant"]
[]
[]
[]
[]
[]
[]
[]
[]
[]
[]
[]
[]
[]
[]
[]
[]
[]
[]
[]
[]
[]
[]
[]
[]
[]
[]
[]
[]
[]
[]
[]
[]
[]
[]
[]
[]
[]
[]
["Le plan d'action prévoit de façon prioritaire:"]
[]
[{"$f":"IF('PLAN d''ACTION'!D347=\"\",\"\",'PLAN d''ACTION'!C347&CHAR(10))&IF('PLAN d''ACTION'!D348=\"\",\"\",'PLAN d''ACTION'!C348&CHAR(10))&IF('PLAN d''ACTION'!D349=\"\",\"\",'PLAN d''ACTION'!C349&CHAR(10))&IF('PLAN d''ACTION'!D350=\"\",\"\",'PLAN d''ACTION'!C350&CHAR(10))&IF('PLAN d''ACTION'!D351=\"\",\"\",'PLAN d''ACTION'!C351&CHAR(10))&IF('PLAN d''ACTION'!D352=\"\",\"\",'PLAN d''ACTION'!C352&CHAR(10))&IF('PLAN d''ACTION'!D353=\"\",\"\",'PLAN d''ACTION'!C353)&IF('PLAN d''ACTION'!D354=\"\",\"\",'PLAN d''ACTION'!C354&CHAR(10))&IF('PLAN d''ACTION'!D355=\"\",\"\",'PLAN d''ACTION'!C355&CHAR(10))&IF('PLAN d''ACTION'!D356=\"\",\"\",'PLAN d''ACTION'!C356&CHAR(10))&IF('PLAN d''ACTION'!D357=\"\",\"\",'PLAN d''ACTION'!C357&CHAR(10))&IF('PLAN d''ACTION'!D358=\"\",\"\",'PLAN d''ACTION'!C358&CHAR(10))&IF('PLAN d''ACTION'!D359=\"\",\"\",'PLAN d''ACTION'!C359&CHAR(10))&IF('PLAN d''ACTION'!D360=\"\",\"\",'PLAN d''ACTION'!C360)","v":""}]
[]
[]
["Le plan d'action prévoit également:"]
[]
[{"$f":"IF('PLAN d''ACTION'!E347=\"\",\"\",'PLAN d''ACTION'!C347&CHAR(10))&IF('PLAN d''ACTION'!E348=\"\",\"\",'PLAN d''ACTION'!C348&CHAR(10))&IF('PLAN d''ACTION'!E349=\"\",\"\",'PLAN d''ACTION'!C349&CHAR(10))&IF('PLAN d''ACTION'!E350=\"\",\"\",'PLAN d''ACTION'!C350&CHAR(10))&IF('PLAN d''ACTION'!E351=\"\",\"\",'PLAN d''ACTION'!C351&CHAR(10))&IF('PLAN d''ACTION'!E352=\"\",\"\",'PLAN d''ACTION'!C352&CHAR(10))&IF('PLAN d''ACTION'!E353=\"\",\"\",'PLAN d''ACTION'!C353)&IF('PLAN d''ACTION'!E354=\"\",\"\",'PLAN d''ACTION'!C354&CHAR(10))&IF('PLAN d''ACTION'!E355=\"\",\"\",'PLAN d''ACTION'!C355&CHAR(10))&IF('PLAN d''ACTION'!E356=\"\",\"\",'PLAN d''ACTION'!C356&CHAR(10))&IF('PLAN d''ACTION'!E357=\"\",\"\",'PLAN d''ACTION'!C357&CHAR(10))&IF('PLAN d''ACTION'!E358=\"\",\"\",'PLAN d''ACTION'!C358&CHAR(10))&IF('PLAN d''ACTION'!E359=\"\",\"\",'PLAN d''ACTION'!C359&CHAR(10))&IF('PLAN d''ACTION'!E360=\"\",\"\",'PLAN d''ACTION'!C360&CHAR(10))&IF('PLAN d''ACTION'!F347=\"\",\"\",'PLAN d''ACTION'!C347&CHAR(10))&IF('PLAN d''ACTION'!F348=\"\",\"\",'PLAN d''ACTION'!C348&CHAR(10))&IF('PLAN d''ACTION'!F349=\"\",\"\",'PLAN d''ACTION'!C349&CHAR(10))&IF('PLAN d''ACTION'!F350=\"\",\"\",'PLAN d''ACTION'!C350&CHAR(10))&IF('PLAN d''ACTION'!F351=\"\",\"\",'PLAN d''ACTION'!C351&CHAR(10))&IF('PLAN d''ACTION'!F352=\"\",\"\",'PLAN d''ACTION'!C352&CHAR(10))&IF('PLAN d''ACTION'!F353=\"\",\"\",'PLAN d''ACTION'!C353)&IF('PLAN d''ACTION'!F354=\"\",\"\",'PLAN d''ACTION'!C354&CHAR(10))&IF('PLAN d''ACTION'!F355=\"\",\"\",'PLAN d''ACTION'!C355&CHAR(10))&IF('PLAN d''ACTION'!F356=\"\",\"\",'PLAN d''ACTION'!C356&CHAR(10))&IF('PLAN d''ACTION'!F357=\"\",\"\",'PLAN d''ACTION'!C357&CHAR(10))&IF('PLAN d''ACTION'!F358=\"\",\"\",'PLAN d''ACTION'!C358&CHAR(10))&IF('PLAN d''ACTION'!F359=\"\",\"\",'PLAN d''ACTION'!C359&CHAR(10))&IF('PLAN d''ACTION'!F360=\"\",\"\",'PLAN d''ACTION'!C360)","v":""}]
[]
[]
[]
[]
[]
["Commentaire"]
[]
[]
[]
[]
[]
[]
["VI","Gestion des risques épidémiques"]
[]
[]
["Les points faibles prioritaires sont:"]
[]
[{"$f":"IF(C863<20,\"Défaut de procédure et/ou d'organisation concernant la gestion du risque épidémique\"&CHAR(10),\"\")&IF(COUNTIF('Eval 6'!E18,\"*élevé*\"),'Eval 6'!B18&CHAR(10),\"\")&IF(COUNTIF('Eval 6'!E19,\"*élevé*\"),'Eval 6'!B19&CHAR(10),\"\")&IF(COUNTIF('Eval 6'!E20,\"*élevé*\"),'Eval 6'!B20&CHAR(10),\"\")&IF(COUNTIF('Eval 6'!E21,\"*élevé*\"),'Eval 6'!B21&CHAR(10),\"\")&IF(COUNTIF('Eval 6'!E22,\"*élevé*\"),'Eval 6'!B22&CHAR(10),\"\")&IF(COUNTIF('Eval 6'!E23,\"*élevé*\"),'Eval 6'!B23&CHAR(10),\"\")&IF(COUNTIF('Eval 6'!E24,\"*élevé*\"),'Eval 6'!B24,\"\")","v":"Défaut de procédure et/ou d'organisation concernant la gestion du risque épidémique\n"}]
[]
["Les points à améliorer sont:"]
[]
[{"$f":"IF(AND(C863>=20,C863<80),\"Procédures et/ou organisation concernant la gestion du risque épidémique\"&CHAR(10),\"\")&IF(COUNTIF('Eval 6'!E18,\"*moyen*\"),'Eval 6'!B18&CHAR(10),\"\")&IF(COUNTIF('Eval 6'!E19,\"*moyen*\"),'Eval 6'!B19&CHAR(10),\"\")&IF(COUNTIF('Eval 6'!E20,\"*moyen*\"),'Eval 6'!B20&CHAR(10),\"\")&IF(COUNTIF('Eval 6'!E21,\"*moyen*\"),'Eval 6'!B21&CHAR(10),\"\")&IF(COUNTIF('Eval 6'!E22,\"*moyen*\"),'Eval 6'!B22&CHAR(10),\"\")&IF(COUNTIF('Eval 6'!E23,\"*moyen*\"),'Eval 6'!B23&CHAR(10),\"\")&IF(COUNTIF('Eval 6'!E24,\"*moyen*\"),'Eval 6'!B24,\"\")","v":"Non respect des PCH\n"}]
[]
["L'évaluation des moyens de maitrise selon l'autoévaluation du GREPHH:"]
[]
[]
[null,null,"% objectifs atteints"]
[null,"Gestion des risques épidémiques",{"$f":"Rapport!$G$134","v":0}]
[]
[]
["Indicateurs de suivi de la Gestion des épidémies: \nSuivi annuel de l'autoévaluation du GREPHH\n"]
[]
[]
[]
[]
[]
[]
[]
[]
[]
[]
[]
[]
[]
[]
[]
["Plan d'action général prioritaire"]
[]
[{"$f":"IF('PLAN d''ACTION'!D419=\"\",\"\",'PLAN d''ACTION'!C419&CHAR(10))&IF('PLAN d''ACTION'!D420=\"\",\"\",'PLAN d''ACTION'!C420&CHAR(10))&IF('PLAN d''ACTION'!D421=\"\",\"\",'PLAN d''ACTION'!C421&CHAR(10))&IF('PLAN d''ACTION'!D422=\"\",\"\",'PLAN d''ACTION'!C422&CHAR(10))&IF('PLAN d''ACTION'!D423=\"\",\"\",'PLAN d''ACTION'!C423&CHAR(10))&IF('PLAN d''ACTION'!D424=\"\",\"\",'PLAN d''ACTION'!C424&CHAR(10))&IF('PLAN d''ACTION'!D425=\"\",\"\",'PLAN d''ACTION'!C425&CHAR(10))","v":""}]
[]
["Plan d'action général à programmer"]
[]
[{"$f":"IF('PLAN d''ACTION'!E419=\"\",\"\",'PLAN d''ACTION'!C419&CHAR(10))&IF('PLAN d''ACTION'!E420=\"\",\"\",'PLAN d''ACTION'!C420&CHAR(10))&IF('PLAN d''ACTION'!E421=\"\",\"\",'PLAN d''ACTION'!C421&CHAR(10))&IF('PLAN d''ACTION'!E422=\"\",\"\",'PLAN d''ACTION'!C422&CHAR(10))&IF('PLAN d''ACTION'!E423=\"\",\"\",'PLAN d''ACTION'!C423&CHAR(10))&IF('PLAN d''ACTION'!E424=\"\",\"\",'PLAN d''ACTION'!C424&CHAR(10))&IF('PLAN d''ACTION'!E425=\"\",\"\",'PLAN d''ACTION'!C425&CHAR(10))&IF('PLAN d''ACTION'!F419=\"\",\"\",'PLAN d''ACTION'!C419&CHAR(10))&IF('PLAN d''ACTION'!F420=\"\",\"\",'PLAN d''ACTION'!C420&CHAR(10))&IF('PLAN d''ACTION'!F421=\"\",\"\",'PLAN d''ACTION'!C421&CHAR(10))&IF('PLAN d''ACTION'!F422=\"\",\"\",'PLAN d''ACTION'!C422&CHAR(10))&IF('PLAN d''ACTION'!F423=\"\",\"\",'PLAN d''ACTION'!C423&CHAR(10))&IF('PLAN d''ACTION'!F424=\"\",\"\",'PLAN d''ACTION'!C424&CHAR(10))&IF('PLAN d''ACTION'!F425=\"\",\"\",'PLAN d''ACTION'!C425)","v":""}]
[]
["Commentaire"]
[]
[]
[]
[]
[]
["VI.1","Gale"]
[]
["Les points faibles prioritaires sont:"]
[]
[{"$f":"IF(C910<20,\"Défaut de procédure et/ou d'organisation concernant la gestion du risque d'épidémie de gale\"&CHAR(10),\"\")&IF(COUNTIF('Eval 6'!E15,\"*élevé*\"),'Eval 6'!B15&CHAR(10),\"\")&IF(COUNTIF('Eval 6'!E16,\"*élevé*\"),'Eval 6'!B16&CHAR(10),\"\")&IF(COUNTIF('Eval 6'!E17,\"*élevé*\"),'Eval 6'!B17&CHAR(10),\"\")&IF(AND(OR('Plan de maitrise épidémie '!F45=\"\",'Plan de maitrise épidémie '!F41=\"\")),\"Défaut d'anticipation logistique d'une épidémie de gale\",\"\")","v":"Défaut de procédure et/ou d'organisation concernant la gestion du risque d'épidémie de gale\nDéfaut d'anticipation logistique d'une épidémie de gale"}]
[]
["Les points à améliorer sont:"]
[]
[{"$f":"IF(AND(C910>=20,C910<80),\"Procédure et/ou organisation concernant la gestion du risque d'épidémie de gale\"&CHAR(10),\"\")&IF(COUNTIF('Eval 6'!E15,\"*moyen*\"),'Eval 6'!B15&CHAR(10),\"\")&IF(COUNTIF('Eval 6'!E16,\"*moyen*\"),'Eval 6'!B16&CHAR(10),\"\")&IF(COUNTIF('Eval 6'!E17,\"*moyen*\"),'Eval 6'!B17,\"\")","v":""}]
[]
["L'évaluation des moyens de maitrise selon l'autoévaluation du GREPHH:"]
[]
[]
[null,null,"% objectifs atteints"]
[null,"Gale",{"$f":"Rapport!G130","v":0}]
[]
[]
[]
["Le plan d'action prévoit de façon prioritaire:"]
[]
[{"$f":"IF('PLAN d''ACTION'!D363=\"\",\"\",'PLAN d''ACTION'!C363&CHAR(10))&IF('PLAN d''ACTION'!D364=\"\",\"\",'PLAN d''ACTION'!C364&CHAR(10))&IF('PLAN d''ACTION'!D365=\"\",\"\",'PLAN d''ACTION'!C365&CHAR(10))&IF('PLAN d''ACTION'!D366=\"\",\"\",'PLAN d''ACTION'!C366&CHAR(10))&IF('PLAN d''ACTION'!D367=\"\",\"\",'PLAN d''ACTION'!C367&CHAR(10))&IF('PLAN d''ACTION'!D368=\"\",\"\",'PLAN d''ACTION'!C368)&IF('PLAN d''ACTION'!D369=\"\",\"\",'PLAN d''ACTION'!C369&CHAR(10))&IF('PLAN d''ACTION'!D370=\"\",\"\",'PLAN d''ACTION'!C370&CHAR(10))&IF('PLAN d''ACTION'!D371=\"\",\"\",'PLAN d''ACTION'!C371&CHAR(10))&IF('PLAN d''ACTION'!D372=\"\",\"\",'PLAN d''ACTION'!C372&CHAR(10))&IF('PLAN d''ACTION'!D373=\"\",\"\",'PLAN d''ACTION'!C373&CHAR(10))&IF('PLAN d''ACTION'!D375=\"\",\"\",'PLAN d''ACTION'!C375&CHAR(10))&IF('PLAN d''ACTION'!D374=\"\",\"\",'PLAN d''ACTION'!C374)","v":""}]
[]
[]
["Le plan d'action prévoit également:"]
[]
[{"$f":"IF('PLAN d''ACTION'!E363=\"\",\"\",'PLAN d''ACTION'!C363&CHAR(10))&IF('PLAN d''ACTION'!E364=\"\",\"\",'PLAN d''ACTION'!C364&CHAR(10))&IF('PLAN d''ACTION'!E365=\"\",\"\",'PLAN d''ACTION'!C365&CHAR(10))&IF('PLAN d''ACTION'!E366=\"\",\"\",'PLAN d''ACTION'!C366&CHAR(10))&IF('PLAN d''ACTION'!E367=\"\",\"\",'PLAN d''ACTION'!C367&CHAR(10))&IF('PLAN d''ACTION'!E368=\"\",\"\",'PLAN d''ACTION'!C368)&IF('PLAN d''ACTION'!E369=\"\",\"\",'PLAN d''ACTION'!C369&CHAR(10))&IF('PLAN d''ACTION'!E370=\"\",\"\",'PLAN d''ACTION'!C370&CHAR(10))&IF('PLAN d''ACTION'!E371=\"\",\"\",'PLAN d''ACTION'!C371&CHAR(10))&IF('PLAN d''ACTION'!E372=\"\",\"\",'PLAN d''ACTION'!C372&CHAR(10))&IF('PLAN d''ACTION'!E373=\"\",\"\",'PLAN d''ACTION'!C373&CHAR(10))&IF('PLAN d''ACTION'!E374=\"\",\"\",'PLAN d''ACTION'!C374&CHAR(10))&IF('PLAN d''ACTION'!E375=\"\",\"\",'PLAN d''ACTION'!C375&CHAR(10))&IF('PLAN d''ACTION'!F363=\"\",\"\",'PLAN d''ACTION'!C363&CHAR(10))&IF('PLAN d''ACTION'!F364=\"\",\"\",'PLAN d''ACTION'!C364&CHAR(10))&IF('PLAN d''ACTION'!F365=\"\",\"\",'PLAN d''ACTION'!C365&CHAR(10))&IF('PLAN d''ACTION'!F366=\"\",\"\",'PLAN d''ACTION'!C366&CHAR(10))&IF('PLAN d''ACTION'!F367=\"\",\"\",'PLAN d''ACTION'!C367&CHAR(10))&IF('PLAN d''ACTION'!F368=\"\",\"\",'PLAN d''ACTION'!C368)&IF('PLAN d''ACTION'!F369=\"\",\"\",'PLAN d''ACTION'!C369&CHAR(10))&IF('PLAN d''ACTION'!F370=\"\",\"\",'PLAN d''ACTION'!C370&CHAR(10))&IF('PLAN d''ACTION'!F371=\"\",\"\",'PLAN d''ACTION'!C371&CHAR(10))&IF('PLAN d''ACTION'!F372=\"\",\"\",'PLAN d''ACTION'!C372&CHAR(10))&IF('PLAN d''ACTION'!F373=\"\",\"\",'PLAN d''ACTION'!C373&CHAR(10))&IF('PLAN d''ACTION'!F375=\"\",\"\",'PLAN d''ACTION'!C375&CHAR(10))&IF('PLAN d''ACTION'!F374=\"\",\"\",'PLAN d''ACTION'!C374)","v":""}]
[]
[]
["Indicateurs de suivi: \nSuivi annuel de l'autoévaluation du GREPHH\nSuivi épidémiologique"]
[]
["Commentaire"]
[]
[]
[]
[]
[]
["VI.2","Tuberculose"]
[]
["Les points faibles prioritaires sont:"]
[]
[{"$f":"IF(C946<20,\"Défaut de procédure et/ou d'organisation concernant la gestion du risque d'épidémie de tuberculose\"&CHAR(10),\"\")&IF(COUNTIF('Eval 6'!E12,\"*élevé*\"),'Eval 6'!B12&CHAR(10),\"\")&IF(COUNTIF('Eval 6'!E13,\"*élevé*\"),'Eval 6'!B13&CHAR(10),\"\")&IF(COUNTIF('Eval 6'!E14,\"*élevé*\"),'Eval 6'!B14&CHAR(10),\"\")&IF('Plan de maitrise épidémie '!F43=\"\",\"Défaut d'anticipation logistique en cas de tuberculose\",\"\")","v":"Défaut de procédure et/ou d'organisation concernant la gestion du risque d'épidémie de tuberculose\nDéfaut d'anticipation logistique en cas de tuberculose"}]
[]
["Les points à consolider sont:"]
[]
[{"$f":"IF(AND(C946>=20,C946<80),\"Procédure et/ou organisation concernant la gestion du risque d'épidémie de tuberculose\"&CHAR(10),\"\")&IF(COUNTIF('Eval 6'!E12,\"*moyen*\"),'Eval 6'!B12&CHAR(10),\"\")&IF(COUNTIF('Eval 6'!E13,\"*moyen*\"),'Eval 6'!B13&CHAR(10),\"\")&IF(COUNTIF('Eval 6'!E14,\"*moyen*\"),'Eval 6'!B14,\"\")","v":"Risque de tuberculose \n"}]
[]
["L'évaluation des moyens de maitrise selon l'autoévaluation du GREPHH:"]
[]
[]
[null,null,"% objectifs atteints"]
[null,"Tuberculose",{"$f":"Rapport!G131","v":0}]
[]
[]
[]
["Le plan d'action prévoit de façon prioritaire:"]
[]
[{"$f":"IF('PLAN d''ACTION'!D376=\"\",\"\",'PLAN d''ACTION'!C376&CHAR(10))&IF('PLAN d''ACTION'!D377=\"\",\"\",'PLAN d''ACTION'!C377&CHAR(10))&IF('PLAN d''ACTION'!D378=\"\",\"\",'PLAN d''ACTION'!C378&CHAR(10))&IF('PLAN d''ACTION'!D379=\"\",\"\",'PLAN d''ACTION'!C379&CHAR(10))&IF('PLAN d''ACTION'!D380=\"\",\"\",'PLAN d''ACTION'!C380&CHAR(10))&IF('PLAN d''ACTION'!D381=\"\",\"\",'PLAN d''ACTION'!C381&CHAR(10))&IF('PLAN d''ACTION'!D382=\"\",\"\",'PLAN d''ACTION'!C382&CHAR(10))&IF('PLAN d''ACTION'!D383=\"\",\"\",'PLAN d''ACTION'!C383&CHAR(10))&IF('PLAN d''ACTION'!D384=\"\",\"\",'PLAN d''ACTION'!C384&CHAR(10))&IF('PLAN d''ACTION'!D385=\"\",\"\",'PLAN d''ACTION'!C385&CHAR(10))&IF('PLAN d''ACTION'!D386=\"\",\"\",'PLAN d''ACTION'!C386&CHAR(10))&IF('PLAN d''ACTION'!D387=\"\",\"\",'PLAN d''ACTION'!C387&CHAR(10))&IF('PLAN d''ACTION'!D388=\"\",\"\",'PLAN d''ACTION'!C388&CHAR(10))&IF('PLAN d''ACTION'!D389=\"\",\"\",'PLAN d''ACTION'!C389&CHAR(10))&IF('PLAN d''ACTION'!D390=\"\",\"\",'PLAN d''ACTION'!C390&CHAR(10))&IF('PLAN d''ACTION'!D391=\"\",\"\",'PLAN d''ACTION'!C391)","v":""}]
[]
[]
["Le plan d'action prévoit également:"]
[]
[{"$f":"IF('PLAN d''ACTION'!E376=\"\",\"\",'PLAN d''ACTION'!C376&CHAR(10))&IF('PLAN d''ACTION'!E377=\"\",\"\",'PLAN d''ACTION'!C377&CHAR(10))&IF('PLAN d''ACTION'!E378=\"\",\"\",'PLAN d''ACTION'!C378&CHAR(10))&IF('PLAN d''ACTION'!E379=\"\",\"\",'PLAN d''ACTION'!C379&CHAR(10))&IF('PLAN d''ACTION'!E380=\"\",\"\",'PLAN d''ACTION'!C380&CHAR(10))&IF('PLAN d''ACTION'!E381=\"\",\"\",'PLAN d''ACTION'!C381&CHAR(10))&IF('PLAN d''ACTION'!E382=\"\",\"\",'PLAN d''ACTION'!C382&CHAR(10))&IF('PLAN d''ACTION'!E383=\"\",\"\",'PLAN d''ACTION'!C383&CHAR(10))&IF('PLAN d''ACTION'!E384=\"\",\"\",'PLAN d''ACTION'!C384&CHAR(10))&IF('PLAN d''ACTION'!E385=\"\",\"\",'PLAN d''ACTION'!C385&CHAR(10))&IF('PLAN d''ACTION'!E386=\"\",\"\",'PLAN d''ACTION'!C386&CHAR(10))&IF('PLAN d''ACTION'!E387=\"\",\"\",'PLAN d''ACTION'!C387&CHAR(10))&IF('PLAN d''ACTION'!E388=\"\",\"\",'PLAN d''ACTION'!C388&CHAR(10))&IF('PLAN d''ACTION'!E389=\"\",\"\",'PLAN d''ACTION'!C389&CHAR(10))&IF('PLAN d''ACTION'!E390=\"\",\"\",'PLAN d''ACTION'!C390&CHAR(10))&IF('PLAN d''ACTION'!E391=\"\",\"\",'PLAN d''ACTION'!C391&CHAR(10))&IF('PLAN d''ACTION'!F376=\"\",\"\",'PLAN d''ACTION'!C376&CHAR(10))&IF('PLAN d''ACTION'!F377=\"\",\"\",'PLAN d''ACTION'!C377&CHAR(10))&IF('PLAN d''ACTION'!F378=\"\",\"\",'PLAN d''ACTION'!C378&CHAR(10))&IF('PLAN d''ACTION'!F379=\"\",\"\",'PLAN d''ACTION'!C379&CHAR(10))&IF('PLAN d''ACTION'!F380=\"\",\"\",'PLAN d''ACTION'!C380&CHAR(10))&IF('PLAN d''ACTION'!F381=\"\",\"\",'PLAN d''ACTION'!C381&CHAR(10))&IF('PLAN d''ACTION'!F382=\"\",\"\",'PLAN d''ACTION'!C382&CHAR(10))&IF('PLAN d''ACTION'!F383=\"\",\"\",'PLAN d''ACTION'!C383&CHAR(10))&IF('PLAN d''ACTION'!F384=\"\",\"\",'PLAN d''ACTION'!C384&CHAR(10))&IF('PLAN d''ACTION'!F385=\"\",\"\",'PLAN d''ACTION'!C385&CHAR(10))&IF('PLAN d''ACTION'!F386=\"\",\"\",'PLAN d''ACTION'!C386&CHAR(10))&IF('PLAN d''ACTION'!F387=\"\",\"\",'PLAN d''ACTION'!C387&CHAR(10))&IF('PLAN d''ACTION'!F388=\"\",\"\",'PLAN d''ACTION'!C388&CHAR(10))&IF('PLAN d''ACTION'!F389=\"\",\"\",'PLAN d''ACTION'!C389&CHAR(10))&IF('PLAN d''ACTION'!F390=\"\",\"\",'PLAN d''ACTION'!C390&CHAR(10))&IF('PLAN d''ACTION'!F391=\"\",\"\",'PLAN d''ACTION'!C391)","v":""}]
[]
[]
["Commentaire"]
[]
[]
[]
[]
[]
[]
["VI.3","GEA"]
[]
["Les points faibles prioritaires sont:"]
[]
[{"$f":"IF(C981<20,\"Défaut de procédure et/ou d'organisation concernant la gestion du risque d'épidémie de GEA\"&CHAR(10),\"\")&IF(COUNTIF('Eval 6'!E6,\"*élevé*\"),'Eval 6'!B6&CHAR(10),\"\")&IF(COUNTIF('Eval 6'!E4,\"*élevé*\"),'Eval 6'!B4&CHAR(10),\"\")&IF(COUNTIF('Eval 6'!E5,\"*élevé*\"),'Eval 6'!B5&CHAR(10),\"\")&IF(COUNTIF('Eval 6'!E7,\"*élevé*\"),'Eval 6'!B7&CHAR(10),\"\")&IF(COUNTIF('Eval 6'!E8,\"*élevé*\"),'Eval 6'!B8&CHAR(10),\"\")&IF(AND(OR('Plan de maitrise épidémie '!F40=\"\",'Plan de maitrise épidémie '!F41=\"\",'Plan de maitrise épidémie '!F44=\"\",'Plan de maitrise épidémie '!F45=\"\",'Plan de maitrise épidémie '!F46=\"\")),\"Défaut d'anticipation logistique d'une épidémie de GEA ou d'ICd\",\"\")","v":"Défaut de procédure et/ou d'organisation concernant la gestion du risque d'épidémie de GEA\nDéfaut d'anticipation logistique d'une épidémie de GEA ou d'ICd"}]
[]
["Les points à consolider sont:"]
[]
[{"$f":"IF(AND(C981>=20,C981<80),\"Procédure et/ou organisation concernant la gestion du risque d'épidémie de GEA\"&CHAR(10),\"\")&IF(COUNTIF('Eval 6'!E4,\"*moyen*\"),'Eval 6'!B4&CHAR(10),\"\")&IF(COUNTIF('Eval 6'!E6,\"*moyen*\"),'Eval 6'!B6&CHAR(10),\"\")&IF(COUNTIF('Eval 6'!E7,\"*moyen*\"),'Eval 6'!B7&CHAR(10),\"\")&IF(COUNTIF('Eval 6'!E8,\"*moyen*\"),'Eval 6'!B8&CHAR(10),\"\")&IF(COUNTIF('Eval 6'!E5,\"*moyen*\"),'Eval 6'!B5,\"\")","v":"Risque d'épidémie d'ICd"}]
[]
["L'évaluation des moyens de maitrise selon l'autoévaluation du GREPHH:"]
[]
[]
[null,null,"% objectifs atteints"]
[null,"GEA",{"$f":"Rapport!G132","v":0}]
[]
["Indicateurs de suivi: \nAutoévaluation du GREPHH\nSuivi épidémiologique des épidémies de GEA"]
[]
[]
[]
[]
[]
[]
[]
[]
[]
[]
[]
[]
[]
[]
[]
[]
["Le plan d'action prévoit de façon prioritaire:"]
[]
[{"$f":"IF('PLAN d''ACTION'!D392=\"\",\"\",'PLAN d''ACTION'!C392&CHAR(10))&IF('PLAN d''ACTION'!D393=\"\",\"\",'PLAN d''ACTION'!C393&CHAR(10))&IF('PLAN d''ACTION'!D394=\"\",\"\",'PLAN d''ACTION'!C394&CHAR(10))&IF('PLAN d''ACTION'!D395=\"\",\"\",'PLAN d''ACTION'!C395&CHAR(10))&IF('PLAN d''ACTION'!D396=\"\",\"\",'PLAN d''ACTION'!C396)&IF('PLAN d''ACTION'!D397=\"\",\"\",'PLAN d''ACTION'!C397&CHAR(10))&IF('PLAN d''ACTION'!D398=\"\",\"\",'PLAN d''ACTION'!C398&CHAR(10))&IF('PLAN d''ACTION'!D399=\"\",\"\",'PLAN d''ACTION'!C399&CHAR(10))&IF('PLAN d''ACTION'!D400=\"\",\"\",'PLAN d''ACTION'!C400&CHAR(10))&IF('PLAN d''ACTION'!D401=\"\",\"\",'PLAN d''ACTION'!C401&CHAR(10))&IF('PLAN d''ACTION'!D402=\"\",\"\",'PLAN d''ACTION'!C402&CHAR(10))&IF('PLAN d''ACTION'!D403=\"\",\"\",'PLAN d''ACTION'!C403&CHAR(10))&IF('PLAN d''ACTION'!D404=\"\",\"\",'PLAN d''ACTION'!C404&CHAR(10))&IF('PLAN d''ACTION'!D405=\"\",\"\",'PLAN d''ACTION'!C405&CHAR(10))&IF('PLAN d''ACTION'!D406=\"\",\"\",'PLAN d''ACTION'!C406&CHAR(10))&IF('PLAN d''ACTION'!D407=\"\",\"\",'PLAN d''ACTION'!C407)","v":""}]
[]
[]
["Le plan d'action prévoit également:"]
[]
[{"$f":"IF('PLAN d''ACTION'!E392=\"\",\"\",'PLAN d''ACTION'!C392&CHAR(10))&IF('PLAN d''ACTION'!E393=\"\",\"\",'PLAN d''ACTION'!C393&CHAR(10))&IF('PLAN d''ACTION'!E394=\"\",\"\",'PLAN d''ACTION'!C394&CHAR(10))&IF('PLAN d''ACTION'!E395=\"\",\"\",'PLAN d''ACTION'!C395&CHAR(10))&IF('PLAN d''ACTION'!E396=\"\",\"\",'PLAN d''ACTION'!C396&CHAR(10))&IF('PLAN d''ACTION'!E397=\"\",\"\",'PLAN d''ACTION'!C397&CHAR(10))&IF('PLAN d''ACTION'!E398=\"\",\"\",'PLAN d''ACTION'!C398&CHAR(10))&IF('PLAN d''ACTION'!E399=\"\",\"\",'PLAN d''ACTION'!C399&CHAR(10))&IF('PLAN d''ACTION'!E400=\"\",\"\",'PLAN d''ACTION'!C400&CHAR(10))&IF('PLAN d''ACTION'!E401=\"\",\"\",'PLAN d''ACTION'!C401&CHAR(10))&IF('PLAN d''ACTION'!E402=\"\",\"\",'PLAN d''ACTION'!C402&CHAR(10))&IF('PLAN d''ACTION'!E403=\"\",\"\",'PLAN d''ACTION'!C403&CHAR(10))&IF('PLAN d''ACTION'!E404=\"\",\"\",'PLAN d''ACTION'!C404&CHAR(10))&IF('PLAN d''ACTION'!E405=\"\",\"\",'PLAN d''ACTION'!C405&CHAR(10))&IF('PLAN d''ACTION'!E406=\"\",\"\",'PLAN d''ACTION'!C406&CHAR(10))&IF('PLAN d''ACTION'!E407=\"\",\"\",'PLAN d''ACTION'!C407&CHAR(10))&IF('PLAN d''ACTION'!F392=\"\",\"\",'PLAN d''ACTION'!C392&CHAR(10))&IF('PLAN d''ACTION'!F393=\"\",\"\",'PLAN d''ACTION'!C393&CHAR(10))&IF('PLAN d''ACTION'!F394=\"\",\"\",'PLAN d''ACTION'!C394&CHAR(10))&IF('PLAN d''ACTION'!F395=\"\",\"\",'PLAN d''ACTION'!C395&CHAR(10))&IF('PLAN d''ACTION'!F396=\"\",\"\",'PLAN d''ACTION'!C396&CHAR(10))&IF('PLAN d''ACTION'!F397=\"\",\"\",'PLAN d''ACTION'!C397&CHAR(10))&IF('PLAN d''ACTION'!F398=\"\",\"\",'PLAN d''ACTION'!C398&CHAR(10))&IF('PLAN d''ACTION'!F399=\"\",\"\",'PLAN d''ACTION'!C399&CHAR(10))&IF('PLAN d''ACTION'!F400=\"\",\"\",'PLAN d''ACTION'!C400&CHAR(10))&IF('PLAN d''ACTION'!F401=\"\",\"\",'PLAN d''ACTION'!C401&CHAR(10))&IF('PLAN d''ACTION'!F402=\"\",\"\",'PLAN d''ACTION'!C402&CHAR(10))&IF('PLAN d''ACTION'!F403=\"\",\"\",'PLAN d''ACTION'!C403&CHAR(10))&IF('PLAN d''ACTION'!F404=\"\",\"\",'PLAN d''ACTION'!C404&CHAR(10))&IF('PLAN d''ACTION'!F405=\"\",\"\",'PLAN d''ACTION'!C405&CHAR(10))&IF('PLAN d''ACTION'!F406=\"\",\"\",'PLAN d''ACTION'!C406&CHAR(10))&IF('PLAN d''ACTION'!F407=\"\",\"\",'PLAN d''ACTION'!C407)","v":""}]
[]
[]
["Commentaire"]
[]
[]
[]
[]
[]
["VI.4","IRA / Grippe"]
[]
["Les points faibles prioritaires sont:"]
[]
[{"$f":"IF(C1030<20,\"Défaut de procédure et/ou d'organisation concernant la gestion du risque d'épidémie d'IRAB\"&CHAR(10),\"\")&IF(COUNTIF('Eval 6'!E9,\"*élevé*\"),'Eval 6'!B9&CHAR(10),\"\")&IF(COUNTIF('Eval 6'!E10,\"*élevé*\"),'Eval 6'!B10&CHAR(10),\"\")&IF(COUNTIF('Eval 6'!E11,\"*élevé*\"),'Eval 6'!B11&CHAR(10),\"\")&IF(AND(OR('Plan de maitrise épidémie '!F42=\"\",'Plan de maitrise épidémie '!F44=\"\")),\"Défaut d'anticipation logistique d'une épidémie d'IRAB\",\"\")","v":"Défaut de procédure et/ou d'organisation concernant la gestion du risque d'épidémie d'IRAB\nDéfaut d'anticipation logistique d'une épidémie d'IRAB"}]
[]
["Les points à consolider sont:"]
[]
[{"$f":"IF(AND(C1030>=20,C1030<80),\"Procédure et/ou organisation concernant la gestion du risque d'épidémie d'IRAB\"&CHAR(10),\"\")&IF(COUNTIF('Eval 6'!E9,\"*moyen*\"),'Eval 6'!B9&CHAR(10),\"\")&IF(COUNTIF('Eval 6'!E10,\"*moyen*\"),'Eval 6'!B10&CHAR(10),\"\")&IF(COUNTIF('Eval 6'!E11,\"*moyen*\"),'Eval 6'!B11,\"\")","v":"Risque d'épidémie d'IRA/grippe\nRetard de vaccination antigrippale des résidents \n"}]
[]
["L'évaluation des moyens de maitrise selon l'autoévaluation du GREPHH:"]
[]
[]
[null,null,"% objectifs atteints"]
[null,"IRA / Grippe",{"$f":"Rapport!G133","v":0}]
[]
["Indicateurs de suivi: \nSuivi annuel de l'autoévaluation du GREPHH\nSuivi épidémiologique des épidémies d'IRAB"]
[]
[]
[]
[]
[]
[]
[]
[]
[]
[]
[]
[]
[]
[]
["Le plan d'action prévoit de façon prioritaire:"]
[]
[{"$f":"IF('PLAN d''ACTION'!D408=\"\",\"\",'PLAN d''ACTION'!C408&CHAR(10))&IF('PLAN d''ACTION'!D409=\"\",\"\",'PLAN d''ACTION'!C409&CHAR(10))&IF('PLAN d''ACTION'!D410=\"\",\"\",'PLAN d''ACTION'!C410&CHAR(10))&IF('PLAN d''ACTION'!D411=\"\",\"\",'PLAN d''ACTION'!C411&CHAR(10))&IF('PLAN d''ACTION'!D412=\"\",\"\",'PLAN d''ACTION'!C412&CHAR(10))&IF('PLAN d''ACTION'!D413=\"\",\"\",'PLAN d''ACTION'!C413&CHAR(10))&IF('PLAN d''ACTION'!D414=\"\",\"\",'PLAN d''ACTION'!C414&CHAR(10))&IF('PLAN d''ACTION'!D415=\"\",\"\",'PLAN d''ACTION'!C415&CHAR(10))&IF('PLAN d''ACTION'!D416=\"\",\"\",'PLAN d''ACTION'!C416&CHAR(10))&IF('PLAN d''ACTION'!D417=\"\",\"\",'PLAN d''ACTION'!C417&CHAR(10))&IF('PLAN d''ACTION'!D418=\"\",\"\",'PLAN d''ACTION'!C418)","v":""}]
[]
[]
["Le plan d'action prévoit également:"]
[]
[{"$f":"IF('PLAN d''ACTION'!E408=\"\",\"\",'PLAN d''ACTION'!C408&CHAR(10))&IF('PLAN d''ACTION'!E409=\"\",\"\",'PLAN d''ACTION'!C409&CHAR(10))&IF('PLAN d''ACTION'!E410=\"\",\"\",'PLAN d''ACTION'!C410&CHAR(10))&IF('PLAN d''ACTION'!E411=\"\",\"\",'PLAN d''ACTION'!C411&CHAR(10))&IF('PLAN d''ACTION'!E412=\"\",\"\",'PLAN d''ACTION'!C412&CHAR(10))&IF('PLAN d''ACTION'!E413=\"\",\"\",'PLAN d''ACTION'!C413&CHAR(10))&IF('PLAN d''ACTION'!E414=\"\",\"\",'PLAN d''ACTION'!C414&CHAR(10))&IF('PLAN d''ACTION'!E415=\"\",\"\",'PLAN d''ACTION'!C415&CHAR(10))&IF('PLAN d''ACTION'!E416=\"\",\"\",'PLAN d''ACTION'!C416&CHAR(10))&IF('PLAN d''ACTION'!E417=\"\",\"\",'PLAN d''ACTION'!C417&CHAR(10))&IF('PLAN d''ACTION'!E418=\"\",\"\",'PLAN d''ACTION'!C418&CHAR(10))&IF('PLAN d''ACTION'!F408=\"\",\"\",'PLAN d''ACTION'!C408&CHAR(10))&IF('PLAN d''ACTION'!F409=\"\",\"\",'PLAN d''ACTION'!C409&CHAR(10))&IF('PLAN d''ACTION'!F410=\"\",\"\",'PLAN d''ACTION'!C410&CHAR(10))&IF('PLAN d''ACTION'!F411=\"\",\"\",'PLAN d''ACTION'!C411&CHAR(10))&IF('PLAN d''ACTION'!F412=\"\",\"\",'PLAN d''ACTION'!C412&CHAR(10))&IF('PLAN d''ACTION'!F413=\"\",\"\",'PLAN d''ACTION'!C413&CHAR(10))&IF('PLAN d''ACTION'!F414=\"\",\"\",'PLAN d''ACTION'!C414&CHAR(10))&IF('PLAN d''ACTION'!F415=\"\",\"\",'PLAN d''ACTION'!C415&CHAR(10))&IF('PLAN d''ACTION'!F416=\"\",\"\",'PLAN d''ACTION'!C416&CHAR(10))&IF('PLAN d''ACTION'!F417=\"\",\"\",'PLAN d''ACTION'!C417&CHAR(10))&IF('PLAN d''ACTION'!F418=\"\",\"\",'PLAN d''ACTION'!C418)","v":""}]
[]
[]
[]
["Commentaire"]
[]
[]
[]
[]
[]
["VII","AES"]
[]
["Les points faibles prioritaires sont:"]
[]
[{"$f":"IF(C1078<20,\"Défaut de procédure et/ou d'organisation concernant la prévention des AES\"&CHAR(10),\"\")&IF(COUNTIF('Eval 7'!E4,\"*élevé*\"),'Eval 7'!B4&CHAR(10),\"\")&IF(COUNTIF('Eval 7'!E6,\"*élevé*\"),'Eval 7'!B6&CHAR(10),\"\")&IF(COUNTIF('Eval 7'!E7,\"*élevé*\"),'Eval 7'!B7&CHAR(10),\"\")&IF(COUNTIF('Eval 7'!E8,\"*élevé*\"),'Eval 7'!B8&CHAR(10),\"\")&IF(COUNTIF('Eval 7'!E5,\"*élevé*\"),'Eval 7'!B5,\"\")","v":"Défaut de procédure et/ou d'organisation concernant la prévention des AES\n"}]
[]
["Les points à consolider sont:"]
[]
[{"$f":"IF(AND(C1078>=20,C1078<80),\"Procédure et/ou organisation concernant la prévention des AES\"&CHAR(10),\"\")&IF(COUNTIF('Eval 7'!E4,\"*moyen*\"),'Eval 7'!B4&CHAR(10),\"\")&IF(COUNTIF('Eval 7'!E6,\"*moyen*\"),'Eval 7'!B6&CHAR(10),\"\")&IF(COUNTIF('Eval 7'!E7,\"*moyen*\"),'Eval 7'!B7&CHAR(10),\"\")&IF(COUNTIF('Eval 7'!E8,\"*moyen*\"),'Eval 7'!B8&CHAR(10),\"\")&IF(COUNTIF('Eval 7'!E5,\"*moyen*\"),'Eval 7'!B5,\"\")","v":"Risque AES (suivi annuel)\n"}]
[]
["L'évaluation des moyens de maitrise selon l'autoévaluation du GREPHH:"]
[]
[]
[null,null,"% objectifs atteints"]
[null,"AES",{"$f":"Rapport!G147","v":0}]
[]
["Indicateurs de suivi: \nSuivi annuel de l'autoévaluation du GREPHH\nSuivi AES"]
[]
[]
[]
[]
[]
[]
[]
[]
[]
[]
[]
[]
[]
[]
[]
[]
[]
[]
[]
[]
[]
[]
[]
[]
[]
[]
[]
["Le plan d'action prévoit de façon prioritaire:"]
[]
[{"$f":"IF('PLAN d''ACTION'!D428=\"\",\"\",'PLAN d''ACTION'!C428&CHAR(10))&IF('PLAN d''ACTION'!D429=\"\",\"\",'PLAN d''ACTION'!C429&CHAR(10))&IF('PLAN d''ACTION'!D430=\"\",\"\",'PLAN d''ACTION'!C430&CHAR(10))&IF('PLAN d''ACTION'!D431=\"\",\"\",'PLAN d''ACTION'!C431&CHAR(10))&IF('PLAN d''ACTION'!D432=\"\",\"\",'PLAN d''ACTION'!C432&CHAR(10))&IF('PLAN d''ACTION'!D433=\"\",\"\",'PLAN d''ACTION'!C433&CHAR(10))&IF('PLAN d''ACTION'!D434=\"\",\"\",'PLAN d''ACTION'!C434&CHAR(10))&IF('PLAN d''ACTION'!D435=\"\",\"\",'PLAN d''ACTION'!C435&CHAR(10))&IF('PLAN d''ACTION'!D436=\"\",\"\",'PLAN d''ACTION'!C436&CHAR(10))&IF('PLAN d''ACTION'!D437=\"\",\"\",'PLAN d''ACTION'!C437&CHAR(10))&IF('PLAN d''ACTION'!D438=\"\",\"\",'PLAN d''ACTION'!C438&CHAR(10))&IF('PLAN d''ACTION'!D439=\"\",\"\",'PLAN d''ACTION'!C439&CHAR(10))&IF('PLAN d''ACTION'!D440=\"\",\"\",'PLAN d''ACTION'!C440&CHAR(10))&IF('PLAN d''ACTION'!D441=\"\",\"\",'PLAN d''ACTION'!C441&CHAR(10))&IF('PLAN d''ACTION'!D442=\"\",\"\",'PLAN d''ACTION'!C442&CHAR(10))&IF('PLAN d''ACTION'!D443=\"\",\"\",'PLAN d''ACTION'!C443&CHAR(10))&IF('PLAN d''ACTION'!D444=\"\",\"\",'PLAN d''ACTION'!C444&CHAR(10))&IF('PLAN d''ACTION'!D445=\"\",\"\",'PLAN d''ACTION'!C445&CHAR(10))&IF('PLAN d''ACTION'!D446=\"\",\"\",'PLAN d''ACTION'!C446&CHAR(10))&IF('PLAN d''ACTION'!D447=\"\",\"\",'PLAN d''ACTION'!C447&CHAR(10))&IF('PLAN d''ACTION'!D448=\"\",\"\",'PLAN d''ACTION'!C448&CHAR(10))&IF('PLAN d''ACTION'!D450=\"\",\"\",'PLAN d''ACTION'!C450&CHAR(10))&IF('PLAN d''ACTION'!D449=\"\",\"\",'PLAN d''ACTION'!C449&CHAR(10))&IF('PLAN d''ACTION'!D451=\"\",\"\",'PLAN d''ACTION'!C451&CHAR(10))&IF('PLAN d''ACTION'!D452=\"\",\"\",'PLAN d''ACTION'!C452)","v":""}]
[]
[]
["Le plan d'action prévoit également:"]
[]
[{"$f":"IF('PLAN d''ACTION'!E428=\"\",\"\",'PLAN d''ACTION'!C428&CHAR(10))&IF('PLAN d''ACTION'!E429=\"\",\"\",'PLAN d''ACTION'!C429&CHAR(10))&IF('PLAN d''ACTION'!E430=\"\",\"\",'PLAN d''ACTION'!C430&CHAR(10))&IF('PLAN d''ACTION'!E431=\"\",\"\",'PLAN d''ACTION'!C431&CHAR(10))&IF('PLAN d''ACTION'!E432=\"\",\"\",'PLAN d''ACTION'!C432&CHAR(10))&IF('PLAN d''ACTION'!E433=\"\",\"\",'PLAN d''ACTION'!C433&CHAR(10))&IF('PLAN d''ACTION'!E434=\"\",\"\",'PLAN d''ACTION'!C434&CHAR(10))&IF('PLAN d''ACTION'!E435=\"\",\"\",'PLAN d''ACTION'!C435&CHAR(10))&IF('PLAN d''ACTION'!E436=\"\",\"\",'PLAN d''ACTION'!C436&CHAR(10))&IF('PLAN d''ACTION'!E437=\"\",\"\",'PLAN d''ACTION'!C437&CHAR(10))&IF('PLAN d''ACTION'!E438=\"\",\"\",'PLAN d''ACTION'!C438&CHAR(10))&IF('PLAN d''ACTION'!E439=\"\",\"\",'PLAN d''ACTION'!C439&CHAR(10))&IF('PLAN d''ACTION'!E440=\"\",\"\",'PLAN d''ACTION'!C440&CHAR(10))&IF('PLAN d''ACTION'!E441=\"\",\"\",'PLAN d''ACTION'!C441&CHAR(10))&IF('PLAN d''ACTION'!E442=\"\",\"\",'PLAN d''ACTION'!C442&CHAR(10))&IF('PLAN d''ACTION'!E443=\"\",\"\",'PLAN d''ACTION'!C443&CHAR(10))&IF('PLAN d''ACTION'!E444=\"\",\"\",'PLAN d''ACTION'!C444&CHAR(10))&IF('PLAN d''ACTION'!E445=\"\",\"\",'PLAN d''ACTION'!C445&CHAR(10))&IF('PLAN d''ACTION'!E446=\"\",\"\",'PLAN d''ACTION'!C446&CHAR(10))&IF('PLAN d''ACTION'!E447=\"\",\"\",'PLAN d''ACTION'!C447&CHAR(10))&IF('PLAN d''ACTION'!E448=\"\",\"\",'PLAN d''ACTION'!C448&CHAR(10))&IF('PLAN d''ACTION'!E450=\"\",\"\",'PLAN d''ACTION'!C450&CHAR(10))&IF('PLAN d''ACTION'!E449=\"\",\"\",'PLAN d''ACTION'!C449&CHAR(10))&IF('PLAN d''ACTION'!E451=\"\",\"\",'PLAN d''ACTION'!C451&CHAR(10))&IF('PLAN d''ACTION'!E452=\"\",\"\",'PLAN d''ACTION'!C452&CHAR(10))&IF('PLAN d''ACTION'!F428=\"\",\"\",'PLAN d''ACTION'!C428&CHAR(10))&IF('PLAN d''ACTION'!F429=\"\",\"\",'PLAN d''ACTION'!C429&CHAR(10))&IF('PLAN d''ACTION'!F430=\"\",\"\",'PLAN d''ACTION'!C430&CHAR(10))&IF('PLAN d''ACTION'!F431=\"\",\"\",'PLAN d''ACTION'!C431&CHAR(10))&IF('PLAN d''ACTION'!F432=\"\",\"\",'PLAN d''ACTION'!C432&CHAR(10))&IF('PLAN d''ACTION'!F433=\"\",\"\",'PLAN d''ACTION'!C433&CHAR(10))&IF('PLAN d''ACTION'!F434=\"\",\"\",'PLAN d''ACTION'!C434&CHAR(10))&IF('PLAN d''ACTION'!F435=\"\",\"\",'PLAN d''ACTION'!C435&CHAR(10))&IF('PLAN d''ACTION'!F436=\"\",\"\",'PLAN d''ACTION'!C436&CHAR(10))&IF('PLAN d''ACTION'!F437=\"\",\"\",'PLAN d''ACTION'!C437&CHAR(10))&IF('PLAN d''ACTION'!F438=\"\",\"\",'PLAN d''ACTION'!C438&CHAR(10))&IF('PLAN d''ACTION'!F439=\"\",\"\",'PLAN d''ACTION'!C439&CHAR(10))&IF('PLAN d''ACTION'!F440=\"\",\"\",'PLAN d''ACTION'!C440&CHAR(10))&IF('PLAN d''ACTION'!F441=\"\",\"\",'PLAN d''ACTION'!C441&CHAR(10))&IF('PLAN d''ACTION'!F442=\"\",\"\",'PLAN d''ACTION'!C442&CHAR(10))&IF('PLAN d''ACTION'!F443=\"\",\"\",'PLAN d''ACTION'!C443&CHAR(10))&IF('PLAN d''ACTION'!F444=\"\",\"\",'PLAN d''ACTION'!C444&CHAR(10))&IF('PLAN d''ACTION'!F445=\"\",\"\",'PLAN d''ACTION'!C445&CHAR(10))&IF('PLAN d''ACTION'!F446=\"\",\"\",'PLAN d''ACTION'!C446&CHAR(10))&IF('PLAN d''ACTION'!F447=\"\",\"\",'PLAN d''ACTION'!C447&CHAR(10))&IF('PLAN d''ACTION'!F448=\"\",\"\",'PLAN d''ACTION'!C448&CHAR(10))&IF('PLAN d''ACTION'!F450=\"\",\"\",'PLAN d''ACTION'!C450&CHAR(10))&IF('PLAN d''ACTION'!F449=\"\",\"\",'PLAN d''ACTION'!C449&CHAR(10))&IF('PLAN d''ACTION'!F451=\"\",\"\",'PLAN d''ACTION'!C451&CHAR(10))&IF('PLAN d''ACTION'!F452=\"\",\"\",'PLAN d''ACTION'!C452)","v":""}]
[]
[]
[]
["Commentaire"]
[]
[" "]
[]
[]
[]
[]
[]
["Dernière date de l'autoévaluation du risque infectieux",null,"Prochaine date"]
["Dernière date de l'évaluation interne",null,"Prochaine date"]
["Dernière date de l'évaluation externe",null,"Prochaine date"]